ontology.acusteme.org
type: Ontology
contributor: Ilaria Contesotto – Università di Torino, Dipartimento di Studi Umanistici
contributor: Valentin Mansilla – Università di Torino, Dipartimento di Studi Umanistici
creator: Giulia Ferdeghini – Università di Torino, Dipartimento di Studi Umanistici
creator: Ilario Meandri – Università di Torino, Dipartimento di Studi Umanistici
creator: Lianna D'Amato – Università di Torino, Dipartimento di Studi Umanistici
comment: L'ontologia ACUSTEME è stata sviluppata per permettere l'interoperabilità dei dati sematici a partire dal sistema catalografico omonimo elaborato per la descrizione di materiali documentali appartenenti ai domini dell'etnomusicologia, della musicologia e della musica per film. Poiché il datamodel di riferimento è basato sui principali standard catalografici nazionali e internazionali e poiché integra standard archivistici, bibliografici e museali in vigore a livello nazionale e internazionale si è cercato di modellare l'ontologia sulla base di ontologie di dominio già esistenti e di ampio uso o di solida e riconosciuta applicabilità. Gli standard catalografici di riferimento sono, in primo luogo, quelli nazionali (ICCU, ICAR, ICCD). I modelli concettuali di riferimento e le ontologie middle-level, cui ci si è ispirati prevedendo possibili allineamenti o espansioni, sono: CIDOC CRM e la sua espansione bibliografica LRMoo, e RIC-CM (con la relativa ontologia RiC-O) per la parte archivistica - attualmente ancora in fase di sviluppo. Dove possibile, le proposte di espansione o di allineamento delle Classi o delle Proprietà sono state rese esplicite. Altre ontologie top-level sono state considerate per la modellazione di pattern diffusi e comuni a molti domini (p.es. SKOS, PROV-O, ArCo...). Poiché l'ontologia ACUSTEME è stata modellata per rispondere alle esigenze di descrizione e interoperabilità del datamodel e in conformità con le regole di catalogazione italiane, alcuni descrittori del modello risultano collegati e definiti in maniera ad esse parallela, al fine di garantire coerenza e interoperabilità con i sistemi bibliografici esistenti; altri metadati sono stati elaborati ad hoc per permettere una più accurata descrizione delle risorse specifiche. Questo approccio, da un lato assicura una base teorica solida per la descrizione di materiali atipici o complessi e spesso a cavallo di standard diversi di catalogazione, e dall’altro riconosce la necessità di eventuali … @it
comment: The ACUSTEME ontology was developed to enable the interoperability of semantic data, based on the homonymous cataloging system designed for the description of documentary materials related to the fields of ethnomusicology, musicology, and film music. Since the reference data model is based on major national and international cataloging standards and integrates archival, bibliographic, and museum standards at both national and international levels, the ontology was designed by leveraging widely used and well-established domain ontologies. The main cataloging standards of reference are national standards (ICCU, ICAR, ICCD). The conceptual models and middle-level ontologies that inspired the ontology—allowing for possible alignments or extensions—include CIDOC CRM and its bibliographic extension LRMoo, as well as RIC-CM (and its corresponding ontology RiC-O) for archival data, which is still under development. Where applicable, proposals for the expansion or alignment of Classes and Properties have been explicitly documented. Other top-level ontologies have been considered for modeling widespread patterns common to multiple domains (e.g., SKOS, PROV-O, ArCo). Since the ACUSTEME ontology was designed to meet the description and interoperability needs of the data model while adhering to Italian cataloging rules, some descriptors in the model are defined in direct correspondence with these rules to ensure consistency and interoperability with existing bibliographic systems. Additionally, some metadata have been specifically developed to allow for a more accurate description of unique resources. This approach ensures, on one hand, a solid theoretical foundation for describing atypical or complex materials that often span multiple cataloging standards. On the other hand, it acknowledges the need for possible amendments to existing standards to better represent the diversity and complexity of resources, as well as the dynamics of contemporary creative processes that lead to …
version info: Acusteme 1.0

absorbs
type: ObjectProperty
inverse of: isAbsorbedBy
domain: Manifestation
range: Manifestation
comment: Collega tra di loro due istanze di Manifestazione @it
comment: Connects two instances of Manifestation to each other
label: assorbe @it

belongsToMusicInstrumentClass
type: ObjectProperty
domain: MusicalInstrumentResource
range: MusicalInstrumentClass
comment: Collega una Risorsa strumento musicale a una delle famiglia di strumenti musicali individuate dalla classificazione Hornbostel-Sachs @it
comment: Connects a Musical Instrument Resource to one of the classes of the Hornbostel-Sachs classification of musical instruments
label: appartieneAFamigliaStrumentiMusicali @it

correspondsWithMediumOfPerformanceLoC
type: ObjectProperty
domain: MusicalInstrumentResource
range: LoCMediumOfPerformance
comment: Collega la Risorsa strumento musicale o l'Organico a un'istanza di Medium della performance @it
comment: Connects the musical instrument resource or the Scoring to an instance of Medium of Performance
label: haCorrispondenzaConMediumDellaPerformanceLoC @it

followsProcess
type: ObjectProperty
sub property of: hasRelationToProcess
inverse of: precedesProcess
domain: Process
range: Process
comment: Fornisce informazioni sulla consequenzialità temporale riguardante i processi creativi e/o produttivi legati alla creazione di una colonna sonora @it
comment: Provides information on the temporal sequence regarding the creative and/or production processes related to the creation of a soundtrack
label: segueProcesso @it

hasAATReference
type: ObjectProperty
sub property of: hasType
domain: BibliographicResource
range: ArtAndArchitectureThesaurus
comment: Collega un'istanza di Risorsa Bibliografica a un'istanza di ArtArchitectureThesaurus @it
comment: Links an instance of Bibliographic Resource to an instance of ArtArchitectureThesaurus
label: haRiferimentoAAT @it

hasAFSClassification
type: ObjectProperty
sub property of: hasType
domain: Manifestation
range: AFSEthnographicThesaurus
comment: Collega un'istanza di Manifestazione a un'istanza di AFS EthnographicThesaurus @it
comment: Links an instance of Manifestation to an instance of AFS EthnographicThesaurus
label: haClassificazioneAFS @it

hasAccessory
type: ObjectProperty
sub property of: hasLinkToInstrument
inverse of: isAccessoryOf
domain: MusicalInstrumentResource
range: MusicalInstrumentResource
comment: Possesses an additional or complementary element that enriches, supports, or enhances a primary object, product, or function. The accessory is not essential for the operation or existence of the object but increases its capabilities, aesthetics, or functionality
comment: Possiede un elemento aggiuntivo o complementare che arricchisce, supporta o migliora un oggetto principale, un prodotto o una funzione. L'accessorio non è essenziale per il funzionamento o l'esistenza dell'oggetto, ma ne aumenta le capacità, l'estetica o la funzionalità @it
label: haAccessorio @it

hasAcquisition
type: ObjectProperty
inverse of: isAcquisitionOf
domain: Class
  union of: Item
  union of: MusicalInstrumentResource
range: Acquisition
comment: Collegamento tra una Risorsa strumento musicale o Esemplare e la sua Acquisizione @it
comment: Connection between a musical instrument resource or exemplar and its Acquisition
label: haAcquisizione @it

hasAcquisitionDate
type: ObjectProperty
sub property of: hasDate
inverse of: isDateOfAcquisitionOf
domain: Acquisition
range: Date
comment: Acquisition date of a resource by a specific Corporate Body
comment: Data di acquisizione di una Risorsa da parte di un determinato ente @it
label: haDataDiAcquisizione @it

hasAgent
type: ObjectProperty
inverse of: isAgentOf
domain: AgentRole
range: Agent
comment: Collega un'istanza della classe ruolo agente all'Agente che lo ricopre @it
comment: Connects an instance of the Agent Role class held by an Agent to the Agent who holds it
label: haAgente @it

hasAgentRole
type: ObjectProperty
inverse of: isAgentRoleOf
domain: Thing
range: AgentRole
comment: Collega una qualunque entità al Ruolo che un Agente assume rispetto a una situazione o una risorsa @it
comment: Links any entity to the Role that an Agent assumes in relation to a situation or a resource
label: haRuoloAgente @it

hasAlternativeScoring
type: ObjectProperty
sub property of: hasScoring
domain: Class
  union of: Expression
  union of: MusicWork
range: Scoring
comment: Collega un'istanza di Opera Musica o di Espressione a una o più istanze di Organico che siano alternative all'Organico principale @it
comment: Links an instance of WorkMusic or Expression to one or more instances of a Scoring that serve as alternatives to the main Scoring
label: haOrganicoAlternativo @it

hasAppellation
type: ObjectProperty
inverse of: isAppellationOf
domain: Thing
range: Appellation
comment: Associa un Appellativo a un'entità @it
comment: Associates an Appellation to an entity
label: haAppellativo @it

hasArchivalRecordSetRelation
type: ObjectProperty
inverse of: isArchivalRecordSetRelationOf
domain: MusicalInstrumentResource
range: RecordSet
comment: Esprime la relazione tra una Risorsa Strumento Musicale e una Risorsa Archivistica di tipo Record Set, in particolare se lo Risorsa Strumento Musicale è o è stato incluso in un fondo archivistico @it
comment: Expresses the relationship between a Musical Instrument Resource and an Archival Resource of type Record Set, particularly if the Musical Instrument Resource is or has been included in an archival collection
label: haRelazioneAdArchRecordSet @it

hasArea
type: ObjectProperty
domain: Class
  union of: AcustemeResource
  union of: Event
range: Area
comment: Collega una Risorsa Acusteme o un Evento a un areale @it
comment: Connects an Acusteme Resource or an Event to an Area
label: haAreale @it

hasBibliographicInfo
type: ObjectProperty
domain: Class
  union of: AcustemeResource
  union of: Agent
range: BibliographyDiscographyOrFilmography
comment: Collega a Risorse esterne di tipo bibliografico, discografico o filmografico tramite URL @it
comment: Links to external resources of bibliographic, discographic, or filmographic type via URL
label: haInfoBibliografiche @it

hasCarrier
type: ObjectProperty
domain: Class
  union of: Item
  union of: Manifestation
  union of: SupplementaryMaterial
range: Carrier
comment: Collega un'istanza di Manifestazione, di Esemplare o di Allegato, ovvero una Risorsa idonea, a un Supporto fisico o digitale attraverso cui si conserva e si manifesta il contenuto @it
comment: Links an instance of Manifestation, Item, or Supplementary Material, or any suitable Resource, to a physical or digital Carrier through which the content is preserved and manifested
label: haSupporto @it

hasCatalogingRecord
type: ObjectProperty
domain: Class
  union of: AcustemeResource
  union of: Agent
  union of: Exhibition
  union of: ShelfMark
range: CatalogingRecord
comment: Collega una Risorsa Acusteme, un Agente, un'Esposizione o una Collocazione ad un'istanza di Scheda catalografica @it
comment: Links an Acusteme Resource, an Agent, an Exhibition, a Shelfmark to an instance of Cataloging Record
label: haSchedaCatalografica @it

hasCollectionMember
type: ObjectProperty
inverse of: isCollectionOf
domain: Collection
range: CollectionMembership
comment: Collega una Collezione alla classe ComponenteCollezione in cui è creato il collegamento con la Manifestazione che ne è parte @it
comment: Connects a Collection to an item of the CollectionMembership class linked to a Manifestation which is part of that Collection
label: haComponenteCollezione @it

hasComponentOrPart
type: ObjectProperty
sub property of: hasLinkToInstrument
inverse of: isComponentOrPartOf
domain: MusicalInstrumentResource
range: MusicalInstrumentResource
comment: Possesses an element or a section that constitutes an integral part of a system, object, or complex structure, where each component or part contributes to the overall functioning or completeness of the referenced entity
comment: Possiede un elemento o una sezione che costituisce una parte integrante di un sistema, oggetto o struttura complessa, dove ogni componente o parte contribuisce al funzionamento complessivo o alla completezza dell'entità di riferimento @it
label: haComponenteOParte @it

hasComponents
type: ObjectProperty
inverse of: isConstituentOf
domain: Class
  union of: ArchivalResource
  union of: Manifestation
range: RecordPart
comment: Archivistic relationship specific to elements cataloged as Record Part
comment: Relazione archivistica specifica per gli elementi catalogati come Record Part @it
label: haCostituenti @it

hasCompositionCreationDate
type: ObjectProperty
sub property of: hasDate
inverse of: isDateOfCompositionOrRealizationOf
domain: MusicWork
range: Date
comment: Chronological information related to the period of composition and/or creation of a resource
comment: Informazioni cronologiche riferite al periodo di composizione e/o realizzazione di una risorsa @it
label: haDataDiComposizioneRealizzazione @it

hasConservationStatus
type: ObjectProperty
domain: Class
  union of: Carrier
  union of: MusicalInstrumentResource
range: ConservationStatus
comment: Collega un'istanza di Supporto o un'istanza di Risorsa Strumento Musicale a un'istanza di Stato di Conservazione @it
comment: Links an instance of Carrier or Musical Instrument Resource to an instance of Conservation Status
label: haStatoDiConservazione @it

hasConservationStatusType
type: ObjectProperty
sub property of: hasType
domain: ConservationStatus
range: ConservationStatusType
comment: Assigns a Type to the Conservation Status: good, poor, fair, etc.
comment: Attribuisce un Tipo allo Stato di Conservazione: buono, cattivo, mediocre ecc. @it
label: haTipoDiStatoDiConservazione @it

hasContent
type: ObjectProperty
domain: Manifestation
range: Content
comment: Collega un'istanza di Manifestazione a una di Contenuto @it
comment: Connects an instance of Manifestation to an instance of Content
label: haContenuto @it

hasContentLanguage
type: ObjectProperty
domain: BibliographicResource
range: Language
comment: Indica la Lingua del contenuto di una Risorsa bibliografica @it
comment: Indicates the language of the content of a bibliographic resource
label: haLinguaDelContenuto @it

hasContinuation
type: ObjectProperty
inverse of: isContinuationOf
domain: Manifestation
range: Manifestation
comment: Dichiara che una Manifestazione ha una continuazione @it
comment: It states that one Manifestation has a continuation
label: continuatoDa @it

hasContinuationOfCollection
type: ObjectProperty
inverse of: isContinuationOfCollection
type: AsymmetricProperty
domain: Collection
range: Collection
comment: Collega un'istanza di Collezione ad un'altra che ne è la continuazione @it
comment: Links an instance of Collection to another that is its continuation
label: haContinuazioneDiCollezione @it

hasCopy
type: ObjectProperty
sub property of: hasGeneticLinkWith
inverse of: isCopyOf
domain: Class
  union of: ArchivalResource
  union of: Manifestation
range: Class
  union of: ArchivalResource
  union of: Manifestation
comment: Collega un'istanza di Manifestazione o di Risorsa Archivistica a un'istanza di Manifestazione o di Risorsa Archivistica @it
comment: Connects an instance of Manifestation or Archival Resource to another instance of Manifestation or Archival Resource
label: haCopia @it

hasCopyrightDate
type: ObjectProperty
sub property of: hasDate
inverse of: isDateOfCopyrightOf
domain: Manifestation
range: Date
comment: Chronological information related to the copyright attribution of a resource
comment: Informazioni cronologiche riferite all'attribuzione del copyright a una risorsa @it
label: haDataDiCopyright @it

hasCountryOfCreationRecordingOrDistribution
type: ObjectProperty
sub property of: hasPlace
domain: Manifestation
range: Place
comment: Collega una Manifestazione a un paese di redazione, registrazione o distribuzione @it
comment: Links a Manifestation to a country of creation, recording, or distribution
label: haPaeseDiRedazioneRegistrazioneOCreazione @it

hasCueRelation
type: ObjectProperty
inverse of: isCueRelationOf
domain: CueSheetEntry
range: CueRelation
comment: Collega un'istanza di Voce Di Cue Sheet a un'istanza di Relazione Cue @it
comment: Links an instance of Cue Sheet Entry to an instance of Cue Relation
label: haRelazioneCue @it

hasCueSheet
type: ObjectProperty
inverse of: isCueSheetOf
domain: FilmAudiovisualMovingImagesWork
range: MusicWork
comment: Collega un'istanza di Film a un'istanza di OperaMusica @it
comment: Connects an instance of WorkFilm to an instance of WorkMusic
label: haCueSheet @it

hasCueSheetEntry
type: ObjectProperty
inverse of: isCueSheetEntryOf
domain: Manifestation
range: CueSheetEntry
comment: Collega un'istanza di Manifestazione, specificatamente di un cue sheet, a una istanza della classe Voce di Cue Sheet @it
comment: Links an instance of Manifestation, specifically a cue sheet, to an instance of the Cue Sheet Entry class
label: haVoceDiCueSheet @it

hasDamage
type: ObjectProperty
domain: ConservationStatus
range: Damage
comment: Collega un'istanza di stato di conservazione relativa a un supporto audio a un possibile danno @it
comment: Links an instance of the preservation state related to an audio medium to a possible damage
label: haDanno @it

hasDamageType
type: ObjectProperty
sub property of: hasType
domain: Damage
range: DamageType
comment: Collega un'istanza di Danno a un'istanza di Tipo Di Danno @it
comment: Links an instance of Damage to an instance of Damage Type
label: haTipoDiDanno @it

hasDate
type: ObjectProperty
inverse of: isDateOf
domain: Thing
range: Date
property chain axiom: hasAcquisitionDate
property chain axiom: hasCompositionCreationDate
property chain axiom: hasCopyrightDate
property chain axiom: hasDraftingDate
property chain axiom: hasExecutionDate
property chain axiom: hasManufactureDate
property chain axiom: hasManufacturingDate
property chain axiom: hasPrintingDate
property chain axiom: hasProductionDate
property chain axiom: hasPublicationDate
property chain axiom: hasRepresentationOrRecordingDate
property chain axiom: hasSurveyDate
property chain axiom: hasUsageDate
property chain axiom: hasValidityDate
comment: La proprietà collega una risorsa a informazioni temporali associate @it
comment: The property connects a resource to associated temporal information
label: haData @it

hasDerivative
type: ObjectProperty
inverse of: isDerivativeOf
domain: Work
range: Work
comment: Property based on the connection between work titles in Reicat 'work based on,' linking the title of one work to the title of another work that has drawn inspiration from it
comment: Proprietà basata sul collegamento tra titoli di opera di Reicat "opera basata su" che collega il titolo di un'opera al titolo di un'altra opera che da essa ha tratto ispirazione @it
label: haDerivata @it

hasDestinationInUseRelation
type: ObjectProperty
inverse of: isDestinationInUseRelation
domain: UseRelation
range: Class
  union of: ArchivalResource
  union of: Manifestation
comment: Collega un'istanza di Relazione di Uso a un'istanza di Manifestazione o di Risorsa Archivistica, indicando che quest'ultima funge da fonte o destinazione della relazione di uso @it
comment: Links an instance of a Use Relation to a Manifestation or Archival Resource, indicating that the latter serves as the source or destination of the usage relation
label: haComeDestinazioneNellaRelazioneDiUso @it

hasDimensions
type: ObjectProperty
domain: Carrier
range: Dimensions
comment: Collega il Supporto alle Dimensioni @it
comment: Links the Carrier to its Dimensions
label: haDimensioni @it

hasDraft
type: ObjectProperty
sub property of: hasGeneticLinkWith
inverse of: isDraftOf
domain: Class
  union of: ArchivalResource
  union of: Manifestation
range: Class
  union of: ArchivalResource
  union of: Manifestation
comment: Collega un'istanza di Manifestazione o di Risorsa Archivistica a un'istanza di Manifestazione o di Risorsa Archivistica @it
comment: Connects an instance of Manifestation or Archival Resource to an instance of Manifestation or Archival Resource
label: haBozza @it

hasDraftingDate
type: ObjectProperty
sub property of: hasDate
inverse of: isDateOfDraftingOf
domain: Manifestation
range: Date
comment: Chronological information related to the drafting period of a resource
comment: Informazioni cronologiche riferite al periodo di redazione di una risorsa @it
label: haDataDiRedazione @it

hasDramaticCategory
type: ObjectProperty
inverse of: isDramaticCategoryOf
domain: Class
  union of: CueSheetEntry
  union of: Manifestation
range: DramaticCategory
comment: Collega un'istanza di VoceDiCueSheet o di Manifestazione, a un'istanza di Categoria Drammatica @it
comment: Connects an instance of CueSheetEntry or Manifestation to an instance of Dramatic Category
label: haCategoriaDrammatica @it

hasEthnomusicologicalResourceType
type: ObjectProperty
sub property of: hasType
domain: Manifestation
range: EthnomusicologicalResourceType
comment: Collega un'istanza di Manifestazione a un'istanza di Tipo di risorsa etnomusicologica @it
comment: Links an instance of Manifestation to an instance of Ethnomusicological Resource Type
label: haTipoDiRisorsaEtnomusicologica @it

hasExecutionDate
type: ObjectProperty
sub property of: hasDate
inverse of: isDateOfExecutionOf
domain: CatalogingCampaign
range: Date
comment: Chronological information related to the dates of a cataloging campaign
comment: Informazioni cronologiche riferite alle date di svolgimento di una campagna di catalogazione @it
label: haDataDiSvolgimento @it

hasExpression
type: ObjectProperty
inverse of: isExpressionOf
domain: Manifestation
range: Expression
comment: Collega un'istanza di Manifestazione a un'istanza di Espressione @it
comment: Links an instance of Manifestation to an instance of Expression
label: haEspressione @it

hasExtent
type: ObjectProperty
domain: Class
  union of: Manifestation
  union of: SupplementaryMaterial
range: Extent
comment: Collega una Risorsa Bibliografica e gli eventuali Allegati alla loro Estensione @it
comment: Links a Bibliographic Resource and any Supplementary Material to their Extent
label: haEstensione @it

hasFilmProductionPhase
type: ObjectProperty
domain: Manifestation
range: FilmProductionPhase
comment: Collega un'istanza di Manifestazione a un'istanza di Fase Produttiva Cinematografica che può essere la pre-produzione cinematografica, la produzione cinematografica, la post-produzione cinematografica o la distribuzione @it
comment: Links an instance of Manifestation to an instance of Cinematographic Production Phase, which can be pre-production, production, post-production, or distribution
label: haFaseProduttivaCinematografica @it

hasGeneticLinkWith
type: ObjectProperty
type: SymmetricProperty
domain: Class
  union of: ArchivalResource
  union of: Manifestation
range: Class
  union of: ArchivalResource
  union of: Manifestation
comment: Indica una relazione tra due risorse di tipo Archivistico o Manifestazione in cui una deriva, si sviluppa o è influenzata dall'altra in un processo di evoluzione, trasformazione o adattamento. Questo collegamento può riguardare opere creative, documenti, idee o altre entità in cui esiste un nesso di continuità o dipendenza concettuale, storica o materiale @it
comment: Indicates a relationship between two resources of type Archival or Manifestation in which one derives from, develops from, or is influenced by the other through a process of evolution, transformation, or adaptation. This connection may involve creative works, documents, ideas, or other entities where there is a link of continuity or conceptual, historical, or material dependence
label: haCollegamentoGeneticoCon @it

hasGenre
type: ObjectProperty
domain: MusicWork
range: MusicalGenre
comment: Collega un'istanza di OperaMusica a una o più istanze di GenereMusicale @it
comment: Links an instance of MusicWork to one or more instances of MusicalGenre
label: haGenere @it

hasHSClassification
type: ObjectProperty
sub property of: hasType
domain: MusicalInstrumentResource
range: HSClassification
comment: Collega una Risorsa Strumento Musicale alla classificazione Hornbostel-Sachs @it
comment: Links a Musical Instrument Resource to the Hornbostel-Sachs classification
label: haClassificazioneHS @it

hasIFLAKey
type: ObjectProperty
sub property of: hasIFLAVocabulary
domain: Class
  union of: BibliographicResource
  union of: CueSheetEntry
  union of: MusicIncipit
range: IFLAKey
comment: Collega un'istanza di RisorsaBibliografica, ContestoMusicale o VoceDiCueSheet a un'istanza di TonalitàIFLA @it
comment: Links an instance of Bibliographic Resource, Musical Context, or Cue Sheet Entry to an instance of Tonality IFLA
label: haTonalitàIFLA @it

hasIFLAMode
type: ObjectProperty
sub property of: hasIFLAVocabulary
domain: BibliographicResource
range: IFLAMode
comment: Collega un'istanza di RisorsaBibliografica, ContestoMusicale o VoceDiCueSheet a un'istanza di ModoIFLA @it
comment: Links an instance of Bibliographic Resource, Musical Context, or Cue Sheet Entry to an instance of IFLAMode
label: haModoIFLA @it

hasIFLAMusicalForm
type: ObjectProperty
sub property of: hasIFLAVocabulary
domain: BibliographicResource
range: IFLAMusicalForm
comment: Collega un'istanza di Risorsa Bibliografica a una istanza di Forma Musicale IFLA @it
comment: Links an instance of Bibliographic Resource to an instance of IFLA Music Form
label: haFormaMusicaleIFLA @it

hasIFLAVocabulary
type: ObjectProperty
sub property of: hasType
domain: BibliographicResource
range: IFLAVocabulary
comment: Collega un'istanza di Risorsa Bibliografica a un'istanza di uno dei Vocabolari IFLA @it
comment: Links a Bibliographic Resource to an instance of an IFLA Vocabulary
label: haVocabolarioIFLA @it

hasIdentifier
type: ObjectProperty
inverse of: isIdentifierOf
domain: Thing
range: Identifier
comment: Collega un'entità qualsiasi a un Identificativo @it
comment: Links any entity to an Identifier
label: haIdentificativo @it

hasInscription
type: ObjectProperty
domain: MusicalInstrumentResource
range: Inscription
comment: Links a Musical Instrument Resource to an instance of Inscription
comment: Unisce una Risorsa strumento musicale ad un'istanza di Iscrizione @it
label: haIscrizione @it

hasInventoryID
type: ObjectProperty
sub property of: hasIdentifier
domain: Class
  union of: Item
  union of: MusicalInstrumentResource
range: Inventory
comment: Collega a un identificativo univoco per gli oggetti inventariabili, che generalmente nell'ambito museale coincide con il numero di registrazione @it
comment: Connects to a unique Identifier for inventoryable objects. In the museum context, it generally corresponds to the registration number
label: haIDInventario @it

hasItem
type: ObjectProperty
inverse of: isItemOf
domain: Manifestation
range: Item
comment: Collega un'istanza di Manifestazione a un'istanza di Esemplare @it
comment: Links an instance of Manifestation to an instance of Item
label: haEsemplare @it

hasLanguage
type: ObjectProperty
sub property of: hasLanguageGroup
domain: Class
  union of: DemographicGroup
  union of: Name
range: Language
comment: Associa un'istanza di Nome o di Gruppo Demografico a una Lingua ISO 639-3. Si intende attribuire al Nome la Lingua nella quale il Nome è espresso e al Gruppo Demografico la Lingua nella quale esso si esprime @it
comment: Associates an instance of Name or Demographic Group with an ISO 639-3 language. It links the Name to the Language in which it is expressed, and the Demographic Group to the Language in which it communicates
label: haLingua @it

hasLanguageGroup
type: ObjectProperty
domain: Class
  union of: DemographicGroup
  union of: Name
range: LanguageGroup
comment: Associa un'istanza di Nome o di Gruppo Demografico a un Gruppo Linguistico ISO 639-5. Si intende attribuire al Nome il Gruppo Linguistico al quale appartiene la lingua nella quale il Nome è espresso e al Gruppo Demografico il Gruppo Linguistico al quale appartiene la lingua nella quale esso si esprime @it
comment: Associates an instance of Name or Demographic Group with an ISO 639-5 Language Group. It links the Name to the Language Group to which the Language in which it is expressed belongs, and the Demographic Group to the Language Group to which the Language, in which it communicates, belongs
label: haGruppoLinguistico @it

hasLinkToCatalogingCampaign
type: ObjectProperty
sub property of: hasLinkToEvent
inverse of: isCatalogingCampaignLinkedTo
domain: CatalogingRecord
range: CatalogingCampaign
comment: Collega una Scheda catalografica a una Campagna di catalogazione @it
comment: Connects a Cataloging Record to a Cataloging Campaign
label: haCollegamentoACampagnaDiCatalogazione @it

hasLinkToCueM
type: ObjectProperty
inverse of: isCueMLinkedTo
domain: Manifestation
range: CueM
comment: Collega un'istanza di Manifestazione a un'istanza di CueM @it
comment: Connects an instance of Manifestation to an instance of CueM
label: haCollegamentoACueM @it

hasLinkToEvent
type: ObjectProperty
inverse of: isEventLinkedTo
domain: Thing
range: Event
comment: Collega un'Entità a una o più istanze di Evento @it
comment: Connects an Entity to one or more instances of Event
label: haCollegamentoAEvento @it

hasLinkToExhibition
type: ObjectProperty
sub property of: hasLinkToEvent
inverse of: isExhibitionLinkedTo
domain: MusicalInstrumentResource
range: Exhibition
comment: Collega un'istanza della classe Risorsa Strumento Musicale con una o più istanze della classe Esposizione @it
comment: Connects an instance of the Musical Instrument Resource class to one or more instances of the Exhibition class
label: haCollegamentoAEsposizione @it

hasLinkToInstrument
type: ObjectProperty
type: SymmetricProperty
domain: MusicalInstrumentResource
range: MusicalInstrumentResource
comment: Collega una Risorsa Strumento Musicale a una Risorsa Strumento Musicale @it
comment: Connects a Musical Instrument Resource to another Musical Instrument Resource
label: haCollegamentoAStrumento @it

hasLinkToResearchCampaign
type: ObjectProperty
sub property of: hasLinkToEvent
inverse of: isResearchCampaignLinkedTo
domain: AcustemeResource
range: ResearchCampaign
comment: Collega una Risorsa Acusteme a una Campagna di ricerca @it
comment: Connects an Acusteme Resource to a Research Campaign
label: haCollegamentoACampagnaDiRicerca @it

hasLinkToRitualEventOrOccasion
type: ObjectProperty
sub property of: hasLinkToEvent
inverse of: isRitualEventOccasionLinkedTo
domain: Class
  union of: BibliographicResource
  union of: MusicalInstrumentResource
range: RitualEventOrOccasion
comment: Collega un'istanza di Risorsa Strumento Musicale o di Risorsa BIbliografica a uno o più eventi Rituali o Occasioni. Uno strumento può essere usato in un evento rituale, una Risorsa bibliografica può avere come soggetto o argomento principale un evento Rituale o un'occasione @it
comment: Connects an instance of Musical Instrument Resource or Bibliographic Resource to one or more Ritual Events or Occasions. A musical instrument can be used in a ritual event, and a bibliographic resource can have a Ritual Event or an Occasion as its main subject or topic
label: haCollegamentoAEventoRitualeOccasione @it

hasLoCGeographicAreas
type: ObjectProperty
domain: Class
  union of: BibliographicResource
  union of: MusicalInstrumentResource
range: GeographicAreasLoC
comment: Collega una Risorsa Strumento Musicale o una Risorsa Bibliografica a una o più istanze di Aree Geografiche di LoC @it
comment: Links a Musical Instrument Resource or a Bibliographic Resource to one or more instances of LoC Geographic Areas
label: haAreeGeograficheLoC @it

hasLoCGraphicMaterialsThesaurusReference
type: ObjectProperty
sub property of: hasType
domain: BibliographicResource
range: ThesaurusGraphicMaterialsLoC
comment: Collega un'istanza di Manifestazione a un'istanza del Thesaurus dei Materiali Grafici di Library of Congress @it
comment: Links an instance of Manifestation to an instance of the Library of Congress Graphic Materials Thesaurus
label: haRiferimentoThesaurusMaterialiGraficiLoC @it

hasLoCSubjectHeading
type: ObjectProperty
sub property of: hasType
domain: BibliographicResource
range: LoCSubjectHeadings
comment: Collega un'istanza di Risorsa Bibliografica a un'istanza del Soggettario di Library Of Congress @it
comment: Links an instance of Bibliographic Resource to an instance of the Library of Congress Subject Headings
label: haSoggettoLoC @it

hasLocalName
type: ObjectProperty
sub property of: hasName
domain: Class
  union of: AgentRole
  union of: MusicalInstrumentResource
  union of: Process
range: LocalName
comment: Associa una Denominazione locale a una Risorsa Strumento Musicale, al Ruolo di un Agente o a un Processo. Ad esempio "marranzano" è una denominazione locale dello "scacciapensieri", "dengbêj" è la denominazione locale del cantore curdo, "spotting" è la Denominazione Locale di una fase produttiva nel contesto di un particolare studio di composizione di musica per film @it
comment: Associates a Local Name with a Musical Instrument Resource, an Agent Role, or a Process. For example, 'marranzano' is a Local Name of the 'jew's-harp,' and 'dengbêj' is the Local Name of the Kurdish singer, 'spotting' is a specific phase in the music production of a film music composer's studio
label: haDenominazioneLocale @it

hasMIMOKeyword
type: ObjectProperty
sub property of: hasType
domain: AcustemeResource
range: MIMOKeyword
comment: Collega una Risorsa a una Keyword del Musical Instruments Museum Online (MIMO) @it
comment: Links a Resource to a Keyword from the Musical Instruments Museum Online (MIMO)
label: haKeywordMIMO @it

hasManifestation
type: ObjectProperty
inverse of: isManifestationOf
domain: Work
range: Manifestation
comment: Collega un'istanza di Opera a un'istanza di Manifestazione @it
comment: Links an instance of Work to an instance of Manifestation
label: haManifestazione @it

hasManufactureDate
type: ObjectProperty
sub property of: hasDate
inverse of: isDateOfManufactureOf
domain: MusicalInstrumentResource
range: Date
comment: Collega un oggetto, in particolare uno strumento musicale, a una data di fabbricazione @it
comment: Links an object, namely a musical instrument, to the date of its manufacture
label: haDataDiFabbricazione @it

hasManufacturingDate
type: ObjectProperty
sub property of: hasDate
inverse of: isDateOfManufacturingOf
domain: Manifestation
range: Date
comment: Chronological information related to the manufacturing period of a resource
comment: Informazioni cronologiche riferite al periodo di manifattura di una risorsa @it
label: haDataDiManifattura @it

hasMeasurement
type: ObjectProperty
domain: MusicalInstrumentResource
range: Measurement
comment: Collega una Risorsa Strumento Musicale a un'istanza di Misurazione Analitica @it
comment: Links a Musical Instrument Resource to an instance of Measurement
label: haMisurazioneAnalitica @it

hasMediaRepresentation
type: ObjectProperty
inverse of: isMediaRepresentationOf
domain: Class
  union of: AcustemeResource
  union of: Agent
range: Media
comment: Collega una Risorsa Acusteme a un'istanza della classe Media @it
comment: Links an Acusteme Resource to an instance of the Media class
label: haRappresentazioneMedia @it

hasMediumOfPerformance
type: ObjectProperty
inverse of: isMediumOfPerformanceOf
domain: Class
  union of: Ensemble
  union of: MusicOrSoundPhenomenon
  union of: Scoring
range: MediumOfPerformance
comment: Collega un'istanza di Fenomeno musicale o di Organico o di Gruppo Ensemble a una o più istanze di Mezzo di Esecuzione (strumenti , voci o oggetti sonori) @it
comment: Links an instance of Musical Phenomenon, Scoring or Enseble to one or more instances of Medium of Performance (instruments, voices, or sound objects)
label: haMezzoDiEsecuzione @it

hasMusicProductionPhase
type: ObjectProperty
domain: Manifestation
range: MusicProductionPhase
comment: Collega un'istanza di Manifestazione (e in particolare le risorse di musica per film) a una istanza di Fase produttiva Musicale che può essere la pre-produzione musicale, la produzione musicale, la post-produzione musicale o il deposito legale @it
comment: Links an instance of Manifestation (particularly music for film resources) to an instance of Music Production Phase, which can be pre-production, production, post-production, or legal deposit
label: haFaseProduttivaMusicale @it

hasMusicalElaborationType
type: ObjectProperty
sub property of: hasType
domain: Elaboration
range: MusicalElaborationType
comment: Collega un'istanza di Elaborazione a un'istanza di Tipo Di Elaborazione Musicale @it
comment: Links an instance of Musical Elaboration to an instance of Musical Elaboration Type
label: haTipoDiElaborazioneMusicale @it

hasName
type: ObjectProperty
inverse of: isNameOf
domain: Thing
range: Name
comment: Associa un'entità a un Nome @it
comment: Associates an entity with its name
label: haNome @it

hasNationality
type: ObjectProperty
sub property of: hasType
domain: DemographicGroup
range: Nationality
comment: Collega un'istanza di Gruppo Demografico a una o più Nazionalità @it
comment: Links an instance of Demographic Group to one or more Nationalities
label: haNazionalità @it

hasOriginal
type: ObjectProperty
sub property of: hasGeneticLinkWith
inverse of: isOriginalOf
domain: Class
  union of: ArchivalResource
  union of: Manifestation
range: Class
  union of: ArchivalResource
  union of: Manifestation
comment: Collega un'istanza di Manifestazione o di Risorsa Archivistica a un'istanza di Manifestazione o di Risorsa Archivistica @it
comment: Connects an instance of Manifestation or Archival Resource to an instance of Manifestation or Archival Resource
label: haOriginale @it

hasOtherEdition
type: ObjectProperty
type: SymmetricProperty
domain: Manifestation
range: Manifestation
comment: Collega tra di loro due istanze di Manifestazione @it
comment: Connects two instances of Manifestation to each other
label: haAltraEdizione @it

hasOtherEditionOfCollection
type: ObjectProperty
type: SymmetricProperty
domain: Collection
range: Collection
comment: La relazione collega due istanze di Collezione, dove la prima costituisce una edizione alternativa o parallela della seconda @it
comment: The relation connects two instances of Collection where the former represents an alternative or parallel edition of the latter.
label: haAltraEdizioneDiCollezione @it

hasPart
type: ObjectProperty
inverse of: isPartOf
domain: Work
range: Work
comment: Collega un'istanza di Opera a un'istanza di Opera @it
comment: Links an instance of Work to an instance of Work
label: haParte @it

hasPerformance
type: ObjectProperty
inverse of: isPerformanceOf
domain: RelationCueRecording
range: Manifestation
comment: Collega un'istanza di RelazioneCue a un'istanza di Manifestazione di tipo Audioregistrazione per la quale possono essere espressi dati relativi al minutaggio @it
comment: Links an instance of CueRelation to an instance of Manifestation of type Audio Recording, for which data related to the timing can be expressed
label: haPerformance @it

hasPlace
type: ObjectProperty
domain: Thing
range: Place
comment: La proprietà collega una qualsiasi entità a una istanza di Luogo @it
comment: The property links any entity to an instance of Place
label: haLuogo @it

hasPlaceOfComposition
type: ObjectProperty
sub property of: hasPlace
domain: MusicWork
range: Place
comment: Collega un'istanza di OperaMusica a un'istanza di Luogo @it
comment: Links an instance of MusicWork to an instance of Place
label: haLuogoDiComposizione @it

hasPlaceOfConservation
type: ObjectProperty
sub property of: hasPlace
domain: Class
  union of: Item
  union of: MusicalInstrumentResource
range: Place
comment: Collega una istanza di Risorsa Strumento Musicale o di Esemplare a un'istanza di Luogo @it
comment: Links an instance of Musical Instrument Resource or Item to an instance of Place
label: haLuogoDiConservazione @it

hasPlaceOfManufacture
type: ObjectProperty
sub property of: hasPlace
domain: MusicalInstrumentResource
range: Place
comment: Collega una Risorsa Strumento Musicale a una o più istanze di Luogo dove è stato fabbricato @it
comment: Links a Musical Instrument Resource to one or more instances of Place where it was manufactured
label: haLuogoDiFabbricazione @it

hasPlaceOfManufactureOrProduction
type: ObjectProperty
sub property of: hasPlace
domain: Manifestation
range: Place
comment: Collega una Manifestazione a una o più istanze di Luogo dove è stato prodotto o manufatto @it
comment: Links a Manifestation to one or more instances of Place where it was produced or crafted
label: haLuogoDiManifatturaOProduzione @it

hasPlaceOfPublication
type: ObjectProperty
sub property of: hasPlace
domain: Manifestation
range: Place
comment: Collega una Manifestazione a una o più istanze di Luogo dove è stato pubblicato @it
comment: Links a Manifestation to one or more instances of Place where it was published
label: haLuogoDiPubblicazione @it

hasPlaceOfUse
type: ObjectProperty
sub property of: hasPlace
domain: MusicalInstrumentResource
range: Place
comment: Collega una Risorsa Strumento Musicale a una o più istanze di Luogo @it
comment: Links a Musical Instrument Resource to one or more instances of Place
label: haLuogoUso @it

hasPreviousShelfMark
type: ObjectProperty
sub property of: hasShelfMark
domain: MusicalInstrumentResource
range: PreviousShelfMark
comment: Collega una istanza di Risorsa Strumento Musicale a una istanza di Collocazione Precedente @it
comment: Connects an instance of Musical Instrument Resource to an instance of Previous Shelfmark
label: haCollocazionePrecedente @it

hasPrintingDate
type: ObjectProperty
sub property of: hasDate
inverse of: isDateOfPrintingOf
domain: Manifestation
range: Date
comment: Chronological information related to the printing period of a resource
comment: Informazioni cronologiche riferite al periodo di stampa di una risorsa @it
label: haDataDiStampa @it

hasProcess
type: ObjectProperty
inverse of: isProcessOf
domain: Manifestation
range: Process
comment: Collega un'istanza di Manifestazione, in particolare le manifestazioni di musica per film, a istanze di Processo inteso come processo cinematografico @it
comment: Links an instance of Manifestation, particularly film music manifestations, to instances of Process as a cinematographic process
label: haProcesso @it

hasProcessName
type: ObjectProperty
domain: Process
range: Name
comment: Generic Name by which the Film Music Production Process is known in specific production contexts
comment: Nome generico con cui il Processo di produzione musicale filmica è noto in specifici contesti produttivi @it
label: haDenominazioneProcesso @it

hasProductionDate
type: ObjectProperty
sub property of: hasDate
inverse of: isDateOfProductionOf
domain: Class
  union of: FilmAudiovisualMovingImagesWork
  union of: Manifestation
range: Date
comment: Chronological information related to the production period of a resource
comment: Informazioni cronologiche riferite al periodo di produzione di una risorsa @it
label: haDataDiProduzione @it

hasProtectionMeasure
type: ObjectProperty
inverse of: isProtectionMeasureOf
domain: MusicalInstrumentResource
range: Protection
comment: Collega una Risorsa Strumento Musicale a una istanza di Tutela dando informazioni sui provvedimenti specifici @it
comment: Links a Musical Instrument Resource to an instance of Protection, providing information about specific measures
label: haProvvedimentoTutela @it

hasPublicationDate
type: ObjectProperty
sub property of: hasDate
inverse of: isDateOfPublicationOf
domain: Manifestation
range: Date
comment: Data o intervallo di date riferite alla pubblicazione di una risorsa @it
comment: Date or date range related to the publication of a resource
label: haDataDiPubblicazione @it

hasRelationToProcess
type: ObjectProperty
type: SymmetricProperty
domain: Process
range: Process
comment: Collega un Processo ad un altro Processo @it
comment: Links one Process to another Process
label: haRelazioneAProcesso @it

hasReply
type: ObjectProperty
sub property of: hasGeneticLinkWith
inverse of: isReplyTo
domain: Class
  union of: ArchivalResource
  union of: Manifestation
range: Class
  union of: ArchivalResource
  union of: Manifestation
comment: Collega un'istanza di Manifestazione o di Risorsa Archivistica rappresentata da una missiva ad un'altra di cui è risposta @it
comment: Connects an instance of Manifestation or Archival Resource to an instance such as a letter to another instance of Manifestation or Archival Resource to which it is a reply
label: haRisposta @it

hasRepresentationOrRecordingDate
type: ObjectProperty
sub property of: hasDate
inverse of: isDateOfRepresentationOrRecordingOf
domain: RepresentationOrRecording
range: Date
comment: Chronological information related to the period of performance and/or recording of a resource
comment: Informazioni cronologiche riferite al periodo di rappresentazione e/o registrazione di una risorsa @it
label: haDataDiRappresentazioneORegistrazione @it

hasRepresentativeExpression
type: ObjectProperty
inverse of: isRepresentativeExpressionOf
domain: Work
range: Expression
comment: Collega un'Opera alla sua Espressione rappresentativa @it
comment: Links a Work to its representative Expression
label: haEspressioneRappresentativa @it

hasRole
type: ObjectProperty
inverse of: isRoleOf
domain: AgentRole
range: Role
comment: Collega un'istanza di Ruolo Agente, cioè il ruolo che un Agente assume rispetto a un'attività o a una risorsa, all'istanza di Ruolo effettivamente ricoperta @it
comment: Links an instance of Agent Role, which is the role an Agent assumes in relation to an activity or resource, to the instance of the role actually held
label: haRuolo @it

hasScore
type: ObjectProperty
inverse of: isScoreOf
domain: RelationCueNotatedMusic
range: Manifestation
comment: Collega un'istanza di RelazioneCue a un'istanza di Manifestazione di tipo Musica Scritta per la quale possono essere espressi dati relativi alle battute @it
comment: Links an instance of CueRelation to an instance of Manifestation of type Notated Music, for which data related to the measures can be expressed
label: haPartitura @it

hasScoring
type: ObjectProperty
domain: Class
  union of: Expression
  union of: MusicWork
range: Scoring
comment: Collega un'istanza di OperaMusica o di Espressione a una o più istanze di Organico @it
comment: Links an instance of WorkMusic or Expression to one or more instances of Scoring
label: haOrganico @it

hasSegmentation
type: ObjectProperty
domain: Class
  union of: AudioMedia
  union of: VideoMedia
range: Segmentation
comment: Collega un'istanza Media audio o Media video a un'istanza di Segmentazione @it
comment: Links an instance of Audio Media or Video Media to an instance of Segmentation
label: haSegmentazione @it

hasShelfMark
type: ObjectProperty
domain: Class
  union of: Item
  union of: MusicalInstrumentResource
range: ShelfMark
comment: Collega una istanza di Risorsa Strumento Musicale o di Esemplare a una istanza di Collocazione @it
comment: Connects an instance of Musical Instrument Resource or Item to an instance of Shelfmark
label: haCollocazione @it

hasSize
type: ObjectProperty
domain: MusicalInstrumentResource
range: Dimensions
comment: Declares the size of a musical instrument through its dimensions
comment: Dichiara l'ingombro di uno strumento musicale attraverso le sue dimensioni @it
label: haIngombro @it

hasSortingTitle
type: ObjectProperty
sub property of: hasTitle
domain: Work
range: SortingTitle
comment: Collega un'istanza di Opera a un'istanza di Titolo di Ordinamento @it
comment: Links an instance of Work to an instance of Sorting Title
label: haTitoloOrdinamento @it

hasSourceInUsageRelationship
type: ObjectProperty
inverse of: isSourceInUseRelation
domain: UseRelation
range: Class
  union of: ArchivalResource
  union of: Manifestation
comment: Collega un'istanza di Relazione Di Uso a un'istanza di Manifestazione o di Risorsa archivistica @it
comment: Links an instance of Use Relationship to an instance of Manifestation or Archival Resource
label: haComeSorgenteNellaRelazioneDiUso @it

hasSparePart
type: ObjectProperty
sub property of: hasLinkToInstrument
inverse of: isSparePartOf
domain: MusicalInstrumentResource
range: MusicalInstrumentResource
comment: Possesses an interchangeable or replaceable component designed to replace a damaged, worn-out, or malfunctioning part within a system or object. A spare part is typically stored as part of maintenance procedures and ensures the continued functionality of the system or object
comment: Possiede un componente intercambiabile o sostituibile progettato per rimpiazzare una parte danneggiata, usurata o non funzionante all'interno di un sistema o oggetto. Un ricambio viene tipicamente conservato come parte delle procedure di manutenzione e assicura il mantenimento del funzionamento del sistema o oggetto @it
label: haRicambio @it

hasSuccessor
type: ObjectProperty
inverse of: isSuccessor
domain: Work
range: Work
comment: Collega un'istanza di Opera a un'istanza di Opera @it
comment: Connects an instance of Work to an other instance of Work
label: haSuccessore @it

hasSupplement
type: ObjectProperty
inverse of: isSupplementOf
domain: Manifestation
range: Manifestation
comment: Collega tra di loro due istanze di Manifestazione @it
comment: Connects two instances of Manifestation to each other
label: haSupplemento @it

hasSupplementaryMaterial
type: ObjectProperty
inverse of: isSupplementaryMaterialOf
domain: Manifestation
range: SupplementaryMaterial
comment: Collega una Manifestazione ad allegati bibliografici che la completano @it
comment: Links a Manifestation to Supplementary Materials that complete it
label: haUnitàAllegato @it

hasSurveyDate
type: ObjectProperty
sub property of: hasDate
inverse of: isDateOfSurveyOf
domain: ResearchCampaign
range: Date
comment: Esprime le date dei rilevamenti delle campagne di ricerca @it
comment: Indicates the dates of fieldwork documentation during research campaigns
label: haDataDiRilevamento @it

hasTitle
type: ObjectProperty
domain: BibliographicResource
range: Title
comment: Collega un'istanza di Risorsa Bibliografica a un'istanza di Titolo @it
comment: Links an instance of Bibliographic Resource to an instance of Title
label: haTitolo @it

hasType
type: ObjectProperty
inverse of: isTypeOf
domain: Thing
range: Type
comment: Collega una qualsiasi Entità a un Tipo, una Classificazione o specificazioni concettuali che la descrivono @it
comment: Links any Entity to a Type, Classification, or conceptual specifications that describe it
label: haTipo @it

hasTypologicalDefinition
type: ObjectProperty
sub property of: hasType
domain: MusicalInstrumentResource
range: TypologicalDefinition
comment: Collega una Risorsa Strumento Musicale a una Definizione tipologica (HS) @it
comment: Links a Musical Instrument Resource to a Typological Definition (HS)
label: haDefinizioneTipologica @it

hasURL
type: ObjectProperty
domain: Thing
range: ExternalResource
comment: Assegna un URL a un'entità qualsiasi @it
comment: Assigns a URL to any entity
label: haURL @it

hasReferenceUnescoIntangibleCHLists
type: ObjectProperty
sub property of: hasType
domain: Manifestation
range: UNESCOIntangibleCulturalHeritageLists
comment: Collega un'istanza di Manifestazione a un'istanza delle Liste dell'Unesco per l'Intangible Cultural Heritage @it
comment: Links an instance of Manifestation to an instance of the UNESCO Intangible Cultural Heritage Lists
label: haRiferimentoUnescoIntangibleCHLists @it

hasReferenceToUnescoThesaurus
type: ObjectProperty
sub property of: hasType
domain: BibliographicResource
range: UNESCOThesaurus
comment: Collega un'istanza di Risorsa Bibliografica a un'istanza del Thesaurus UNESCO @it
comment: Links an instance of Bibliographic Resource to an instance of the UNESCO Thesaurus
label: haRiferimentoUnescoThesaurus @it

hasUsageDate
type: ObjectProperty
sub property of: hasDate
inverse of: isDateOfUseOf
domain: MusicalInstrumentResource
range: Date
comment: Esprime un periodo temporale durante il quale l'oggetto in dominio, specificatamente uno strumento musicale o un oggetto sonoro è stato utilizzato @it
comment: Indicates a time period during which the object in question, specifically a musical instrument or a sound object, was used
label: haDataUso @it

hasValidityDate
type: ObjectProperty
sub property of: hasDate
inverse of: isDateOfValidityOf
domain: Class
  union of: PreviousInventory
  union of: PreviousShelfMark
  union of: SpecialInventory
range: Date
comment: Esprime le date entro le quali è stata valida una segnatura di collocazione di uno strumento musicale o un numero di inventario di una Risorsa @it
comment: Indicates the dates during which the location marking of a musical instrument or the inventory number of a resource was valid
label: haDataDiValidità @it

includes
type: ObjectProperty
inverse of: isIncludedIn
domain: AcustemeResource
range: AcustemeResource
comment: Archival relation linking one instance of Acusteme Resource to another instance of Acusteme Resource. Elaborated on the basis of Ric-O, it is intended as a link made in the present or in the past
comment: Relazione archivistica che collega un'istanza di Risorsa Acusteme ad un'altra istanza di Risorsa Acusteme. Elaborata sulla base di Ric-O, è da intendersi come collegamento realizzato nel presente oppure nel passato @it
label: include @it

includesManifestation
type: ObjectProperty
inverse of: isPartOfCollection
domain: Collection
range: Manifestation
comment: A relationship that indicates that a Collection includes a Manifestation
comment: Relazione che indica il fatto che una Collezione comprende una Manifestazione @it
label: comprendeManifestazione @it

includesOrContains
type: ObjectProperty
inverse of: partOf
domain: Manifestation
range: Manifestation
comment: Collega un'istanza di Manifestazione ad un'altra che vi è compresa @it
comment: Connects an instance of Manifestation to another instance of Manifestation that is included within it
label: comprendeOContiene @it

includesProcess
type: ObjectProperty
sub property of: hasRelationToProcess
inverse of: isIncludedInProcess
domain: Process
range: Process
comment: Dà informazioni di gerarchia tra processi creativi e/o produttivi relativi alla realizzazione di una colonna sonora @it
comment: Provides hierarchical information between creative and/or production processes related to the creation of a soundtrack
label: includeProcesso @it

isAbsorbedBy
type: ObjectProperty
domain: Manifestation
range: Manifestation
comment: Collega tra di loro due istanze di Manifestazione @it
comment: Connects two instances of Manifestation to each other
label: assorbitaDa @it

isAccessoryOf
type: ObjectProperty
sub property of: hasLinkToInstrument
domain: MusicalInstrumentResource
range: MusicalInstrumentResource
comment: It is an additional or complementary element that enhances, completes, or supports another primary object. An accessory is not essential to the primary function of the object it is associated with, but it improves its use, aesthetics, or capabilities
comment: È un elemento aggiuntivo o complementare che arricchisce, completa o supporta un altro oggetto principale. Un accessorio non è essenziale per la funzione primaria dell'oggetto a cui è associato, ma ne migliora l'uso, l'estetica o le capacità @it
label: accessorioDi @it

isAcquisitionOf
type: ObjectProperty
domain: Acquisition
range: Class
  union of: Item
  union of: MusicalInstrumentResource
comment: Collegamento tra una Acquisizione e una Risorsa strumento musicale o un Esemplare @it
comment: Connects an Acquisition and a Musical Instrument Resource or an Item
label: acquisizioneDi @it

isAgentOf
type: ObjectProperty
domain: Agent
range: AgentRole
comment: Collega un Agente a uno specifico Ruolo Agente da esso ricoperto @it
comment: Links an Agent to a specific Agent Role they hold
label: agenteDi @it

isAgentRoleOf
type: ObjectProperty
domain: AgentRole
range: Thing
comment: Collega il Ruolo ricoperto da un Agente a una qualunque entità per la quale o nella quale tale Ruolo è stato ricoperto da tale Agente @it
comment: Connects the Role held by an Agent to any entity for which or in which that Role has been held by that Agent
label: ruoloAgenteDi @it

isAlternativeToTheFollowing
type: ObjectProperty
type: AsymmetricProperty
domain: MediumOfPerformance
range: MediumOfPerformance
comment: Indica se il Mezzo di Esecuzione (voce, strumento, oggetto sonoro...) è alternativo Mezzo di Esecuzione che segue nella lista @it
comment: Indicates if the Medium of Performance (voice, instrument, sound object...) is alternative to the Medium of Performance that follows in the list
label: alternativoAlSeguente @it

isAppellationOf
type: ObjectProperty
domain: Appellation
range: Thing
comment: Associa un Appellativo a un'entità @it
comment: It associates an Appellation to an Entity
label: appellativoDi @it

isArchivalRecordSetRelationOf
type: ObjectProperty
domain: RecordSet
range: MusicalInstrumentResource
comment: Esprime il fatto che un Record Set Archivistico (insieme di risorse archivistiche), in particolare un Fondo, includa o abbia incluso una Risorsa Strumento Musicale @it
comment: Expresses the fact that a Record Set of archival resources, namely of type Fonds, includes or has included a Musical Instrument Resource
label: relazioneArchRecordSetDi @it

isCatalogingCampaignLinkedTo
type: ObjectProperty
sub property of: isEventLinkedTo
domain: CatalogingCampaign
range: CatalogingRecord
comment: Collega una Campagna di Catalogazione a una Scheda catalografica @it
comment: Links a Cataloging Campaign to a Cataloging Record
label: campagnaDiCatalogazioneCollegataA @it

isCollectionMember
type: ObjectProperty
inverse of: isMemberInCollection
domain: Manifestation
range: CollectionMembership
comment: Collega una Manifestazione alla classe ComponenteCollezione in cui è creato il collegamento a una Collezione di cui fa parte @it
comment: Connects a Manifestation to the Collection Membership class, where the link to a Collection of which it is part, is made
label: componenteCollezione @it

isCollectionOf
type: ObjectProperty
domain: CollectionMembership
range: Collection
comment: Collega un'istanza della classe Componente Collezione con la Collezione di cui è parte @it
comment: Connects an instance of the class Collection Member with the Collection to which it belongs
label: collezioneDi @it

isComponentOrPartOf
type: ObjectProperty
sub property of: hasLinkToInstrument
domain: MusicalInstrumentResource
range: MusicalInstrumentResource
comment: A component or part is essential for the system or object to function properly, and without it, the entity may not operate as intended
comment: Un componente o parte è essenziale affinché il sistema o l'oggetto funzioni correttamente, e senza di esso, l'entità potrebbe non operare come previsto @it
label: componenteOParteDi @it

isConstituentOf
type: ObjectProperty
domain: RecordPart
range: Class
  union of: ArchivalResource
  union of: Manifestation
comment: Relationship linking an archival Record Part to an Archival Resource or Manifestation of which it is a constituent element
comment: Relazione che collega una ParteDiRisorsa archivistica a una Risorsa archivistica o a una Manifestazione di cui è elemento costituente @it
label: costituenteDi @it

isContinuationOf
type: ObjectProperty
domain: Manifestation
range: Manifestation
comment: Dichiara che una Manifestazione ne continua un'altra @it
comment: It states that one instance of Manifestation continues a previous one
label: continuazioneDi @it

isContinuationOfCollection
type: ObjectProperty
type: AsymmetricProperty
domain: Collection
range: Collection
comment: Collega un'istanza di Collezione ad un'altra di cui è la continuazione @it
comment: Links an instance of Collection to another by which it is continued
label: continuazioneDiCollezione @it

isCopyOf
type: ObjectProperty
sub property of: hasGeneticLinkWith
domain: Class
  union of: ArchivalResource
  union of: Manifestation
range: Class
  union of: ArchivalResource
  union of: Manifestation
comment: Collega un'istanza di Manifestazione o di Risorsa Archivistica a un'istanza di Manifestazione o di Risorsa Archivistica @it
comment: Connects an instance of Archival Resource or Manifestation to an instance of Archival Resource or Manifestation
label: copiaDi @it

isCueMLinkedTo
type: ObjectProperty
domain: CueM
range: Manifestation
comment: Collega un'istanza di CueM a una Manifestazione @it
comment: Links an instance of CueM to an instance of Manifestation
label: cueMCollegatoA @it

isCueRelationOf
type: ObjectProperty
domain: CueRelation
range: CueSheetEntry
comment: Collega un'istanza di Relazione Cue alla Voce di Cue Sheet interessata dalla relazione @it
comment: Links a Cue Relation instance to the Cue Sheet Entry affected by the Relation
label: relazioneCueDi @it

isCueSheetEntryOf
type: ObjectProperty
domain: CueSheetEntry
range: Manifestation
comment: Collega un'istanza della classe Voce di Cue Sheet a un'istanza di Manifestazione di tipo Cue Sheet @it
comment: Links an instance of Cue Sheet Entry class to a Manifestation instance of type Cue Sheet
label: voceDiCueSheetDi @it

isCueSheetOf
type: ObjectProperty
domain: MusicWork
range: FilmAudiovisualMovingImagesWork
comment: Collega un’istanza di Opera Musica a un’istanza di Opera Film Audiovisivi Imagini in Movimento @it
comment: Links an instance of Music Work to an instance of Film Audiovisual Moving Images Work
label: cueSheetDi @it

isDateOf
type: ObjectProperty
domain: Date
range: Thing
property chain axiom: isDateOfAcquisitionOf
property chain axiom: isDateOfCompositionOrRealizationOf
property chain axiom: isDateOfCopyrightOf
property chain axiom: isDateOfDraftingOf
property chain axiom: isDateOfManufactureOf
property chain axiom: isDateOfManufacturingOf
property chain axiom: isDateOfProductionOf
property chain axiom: isDateOfPublicationOf
property chain axiom: isDateOfRepresentationOrRecordingOf
property chain axiom: isDateOfSurveyOf
property chain axiom: isDateOfUseOf
property chain axiom: isDateOfValidityOf
comment: La proprietà associa informazioni temporali alla risorsa a cui si riferiscono @it
comment: The property associates temporal information with the resource it refers to
label: dataDi @it

isDateOfAcquisitionOf
type: ObjectProperty
sub property of: isDateOf
domain: Date
range: Acquisition
comment: Acquisition date of a resource by a specific Corporate Body
comment: Segnala la data di acquisizione di una Risorsa da parte di un determinato ente @it
label: dataDiAcquisizioneDi @it

isDateOfCompositionOrRealizationOf
type: ObjectProperty
sub property of: isDateOf
domain: Date
range: MusicWork
comment: Data riferita al periodo di composizione e/o realizzazione di un'Opera @it
comment: Date related to the period of composition and/or creation of a Work
label: dataDiComposizioneRealizzazioneDi @it

isDateOfCopyrightOf
type: ObjectProperty
sub property of: isDateOf
domain: Date
range: Manifestation
comment: Chronological information related to the copyright attribution of a Manifestation
comment: Informazioni cronologiche riferite all'attribuzione del copyright a una Manifestazione @it
label: dataDiCopyrightDi @it

isDateOfDraftingOf
type: ObjectProperty
sub property of: isDateOf
domain: Date
range: Manifestation
comment: Data riferita al periodo di redazione di una Manifestazione @it
comment: Date related to the period of drafting of a Manifestation
label: dataDiRedazioneDi @it

isDateOfExecutionOf
type: ObjectProperty
sub property of: isDateOf
domain: Date
range: CatalogingCampaign
comment: Data riferita allo svolgimento di una Campagna di catalogazione @it
comment: Date related to the execution of a Cataloging Campaign
label: dataDiSvolgimentoDi @it

isDateOfManufactureOf
type: ObjectProperty
sub property of: isDateOf
domain: Date
range: MusicalInstrumentResource
comment: Data di fabbricazione di un oggetto in particolare di uno strumento musicale @it
comment: Date of manufacture of an object, namely a musical instrument
label: dataDiFabbricazioneDi @it

isDateOfManufacturingOf
type: ObjectProperty
sub property of: isDateOf
domain: Date
range: Manifestation
comment: Reference to the manufacturing date of a resource of type Manifestation
comment: Riferimento alla data di manifattura di una risorsa di tipo Manifestazione @it
label: dataDiManifatturaDi @it

isDateOfPrintingOf
type: ObjectProperty
sub property of: isDateOf
domain: Date
range: Manifestation
comment: Data di stampa di una risorsa di tipo Manifestazione @it
comment: Date of printing of a resource of type Manifestation
label: dataDiStampaDi @it

isDateOfProductionOf
type: ObjectProperty
sub property of: isDateOf
domain: Date
range: Class
  union of: FilmAudiovisualMovingImagesWork
  union of: Manifestation
comment: Data di produzione di una risorsa di tipo Manifestazione o Opera Film Audiovisivi Immagini in Movimento @it
comment: Date of production of a resource of type Manifestation or Film Audiovisual Moving Image Work
label: dataDiProduzioneDi @it

isDateOfPublicationOf
type: ObjectProperty
sub property of: isDateOf
domain: Date
range: Manifestation
comment: Collega la data di pubblicazione a una risorsa di tipo Manifestazione @it
comment: Links the Date of publication to a resource of type Manifestation
label: dataDiPubblicazioneDi @it

isDateOfRepresentationOrRecordingOf
type: ObjectProperty
sub property of: isDateOf
domain: Date
range: RepresentationOrRecording
comment: Data di rappresentazione o registrazione di un fenomeno @it
comment: Representation or Recording date of a specific phenomenon
label: dataDiRappresentazioneORegistrazioneDi @it

isDateOfSurveyOf
type: ObjectProperty
sub property of: isDateOf
domain: Date
range: ResearchCampaign
comment: Data di svolgimento di una Campagna di ricerca @it
comment: Date or range of dates of a Research Campaign
label: dataDiRilevamentoDi @it

isDateOfUseOf
type: ObjectProperty
sub property of: isDateOf
domain: Date
range: MusicalInstrumentResource
comment: Collega la data o le date durante il quale l'oggetto, specificatamente uno strumento musicale o un oggetto sonoro, è stato utilizzato @it
comment: Links the date or range of dates during which the object, specifically a musical instrument or sound object, was used
label: dataUsoDi @it

isDateOfValidityOf
type: ObjectProperty
sub property of: isDateOf
domain: Date
range: Class
  union of: PreviousInventory
  union of: PreviousShelfMark
  union of: SpecialInventory
comment: Collega le date entro le quali la segnatura di collocazione di uno strumento musicale o un numero di inventario di una risorsa sono stati validi @it
comment: Links dates within which a Shelf mark of a musical instrument or an Inventory number of a Resource were valid
label: dataDiValiditàDi @it

isDerivativeOf
type: ObjectProperty
type: AsymmetricProperty
type: TransitiveProperty
type: IrreflexiveProperty
domain: Work
range: Work
comment: Property based on the connection between work titles in Reicat 'work based on,' linking the title of one work to the title of another work upon which it is based. In LRM00 this property associates an instance of Work which modifies the content of another instance of Work with the latter
comment: Proprietà basata sul collegamento tra titoli di opera di Reicat "opera basata su" che collega il titolo di un'opera al titolo di un'altra opera sulla quale è basata. La medesima proprietà nel'ontologia LRM00 collega un'istanza di Work che modifica il contenuto di un'latra istanza di Work @it
label: derivativaDi @it

isDestinationInUseRelation
type: ObjectProperty
domain: Class
  union of: ArchivalResource
  union of: Manifestation
range: UseRelation
comment: Collega un'istanza di Manifestazione o di Risorsa archivistica ad un'istanza di Relazione Di Uso indicando che essa è la Destinazione o fonte di una Relazione di Uso @it
comment: Links an instance of Manifestation or Archival Resource to an instance of Use Relation, indicating that it is the destination of a use relationship.
label: destinazioneNellaRelazioneDiUso @it

isDraftOf
type: ObjectProperty
sub property of: hasGeneticLinkWith
domain: Class
  union of: ArchivalResource
  union of: Manifestation
range: Class
  union of: ArchivalResource
  union of: Manifestation
comment: Collega un'istanza di Manifestazione o di Risorsa Archivistica a un'istanza di Manifestazione o di Risorsa Archivistica @it
comment: Connects an instance of Manifestation or Archival Resource to an instance of Manifestation or Archival Resource
label: bozzaDi @it

isDramaticCategoryOf
type: ObjectProperty
domain: DramaticCategory
range: Class
  union of: CueSheetEntry
  union of: Manifestation
comment: Collega un'istanza di Categoria Drammatica a un'istanza di VoceDiCueSheet o di Manifestazione @it
comment: Links an instance of Dramatic Category to an instance of Cue Sheet Entry or Manifestation
label: categoriaDrammaticaDi @it

isEventLinkedTo
type: ObjectProperty
domain: Event
range: Thing
comment: Collega uno o più Eventi a una qualsiasi entità @it
comment: Links one or more Events to an instance of Entity
label: eventoCollegatoA @it

isExhibitionLinkedTo
type: ObjectProperty
sub property of: isEventLinkedTo
type: FunctionalProperty
domain: Exhibition
range: MusicalInstrumentResource
comment: Collega un'istanza di Esposizione con una o più istanze della classe Risorsa Strumento Musicale @it
comment: Links an instance of Exhibition with one or more instances of the Musical Instrument Resource class
label: esposizioneCollegataA @it

isExpressionOf
type: ObjectProperty
domain: Expression
range: Manifestation
comment: Collega un'istanza di Espressione a un'istanza di Manifestazione @it
comment: Links an instance of Expression to an instance of Manifestation
label: espressioneDi @it

isIdentifierOf
type: ObjectProperty
domain: Identifier
range: Thing
comment: Collega un Identificativo a un'entità qualsiasi @it
comment: Links an Identifier to any Entity
label: identificativoDi @it

isInUse
type: ObjectProperty
inverse of: isInUseBy
domain: DemographicGroup
range: MusicalInstrumentResource
comment: Collega una o più istanze di Gruppo Demografico a un'istanza di Risorsa Strumento Musicale e intende esprimere il fatto che quel particolare Gruppo Demografico utilizza quello specifico strumento @it
comment: Links one or more instances of a Demographic Group to an instance of a Musical Instrument Resource and aims to express that this particular Demographic Group uses that specific instrument
label: haInUso @it

isInUseBy
type: ObjectProperty
domain: MusicalInstrumentResource
range: DemographicGroup
comment: Collega un'istanza di Risorsa Strumento Musicale a una o più istanze di Gruppo Demografico e intende esprimere il fatto che quello specifico strumento è usato da quel particolare Gruppo Demografico @it
comment: Links an instance of Musical Instrument Resource to one or more instances of Demographic Group, indicating that the specific instrument is used by that particular Demographic Group
label: inUsoPresso @it

isIncludedIn
type: ObjectProperty
domain: AcustemeResource
range: AcustemeResource
comment: Archival relationship that links an instance of Acusteme Resource to another instance of Acusteme Resource
comment: Relazione archivistica che collega un'istanza di RisorsaAcusteme ad un'altra istanza di RisorsaAcusteme @it
label: inclusoIn @it

isIncludedInProcess
type: ObjectProperty
sub property of: hasRelationToProcess
domain: Process
range: Process
comment: Information is provided about the hierarchy between the creative and/or production processes related to the creation of a soundtrack
comment: Vengono fornite informazioni sulla gerarchia tra i processi creativi e/o produttivi legati alla realizzazione di una colonna sonora @it
label: inclusoInProcesso @it

isItemOf
type: ObjectProperty
domain: Item
range: Manifestation
comment: Collega un'istanza di Esemplare a un'istanza di Manifestazione @it
comment: Links an instance of Item to an instance of Manifestation
label: esemplareDi @it

isMadeOfMaterial
type: ObjectProperty
domain: Class
  union of: Carrier
  union of: MusicalInstrumentResource
range: Material
comment: Collega una Risorsa Strumento Musicale o un Supporto a un'istanza della classe Materiale @it
comment: Links a Musical Instrument Resource or a Carrier to an instance of the Material class
label: fattoDiMateriale @it

isManifestationOf
type: ObjectProperty
domain: Manifestation
range: Work
comment: Collega un'istanza di Manifestazione a un'istanza di Opera @it
comment: Links an instance of Manifestation to an instance of Work
label: manifestazioneDi @it

isMediaRepresentationOf
type: ObjectProperty
domain: Media
range: Class
  union of: AcustemeResource
  union of: Agent
comment: Collega un'istanza della classe Media a un'istanza di Risorsa Acusteme @it
comment: Links an instance of the Media class to an instance of Acusteme Resource
label: rappresentazioneMediaDi @it

isMediumOfPerformanceOf
type: ObjectProperty
domain: MediumOfPerformance
range: Class
  union of: Ensemble
  union of: MusicOrSoundPhenomenon
  union of: Scoring
comment: Collega il Mezzo di Esecuzione, sia esso strumentale, vocale o di altro tipo al Gruppo o Ensemble, al Fenomeno Musicale o Sonoro o all'Organico di cui fa parte @it
comment: Connects the Medium of Performance, whether instrumental, vocal, or other to the Ensemble, Musical or Sound Phenomenon, or Scoring of which it is a part
label: mezzoDiEsecuzioneDi @it

isMemberInCollection
type: ObjectProperty
domain: CollectionMembership
range: Manifestation
comment: Collega un elemento della classe Componente Collezione alla Manifestazione relativa @it
comment: Connects an instance of the Collection Membership class to the related Manifestation
label: componenteNellaCollezione @it

isNameOf
type: ObjectProperty
domain: Name
range: Thing
comment: Associa un Nome a un'entità @it
comment: Associates a Name with an entity
label: nomeDi @it

isOriginalOf
type: ObjectProperty
sub property of: hasGeneticLinkWith
domain: Class
  union of: ArchivalResource
  union of: Manifestation
range: Class
  union of: ArchivalResource
  union of: Manifestation
comment: Collega un'istanza di Manifestazione o di Risorsa Archivistica a un'istanza di Manifestazione o di Risorsa Archivistica @it
comment: Connects an instance of Manifestation or Archival Resource to an instance of Manifestation or Archival Resource
label: originaleDi @it

isPartOf
type: ObjectProperty
domain: Work
range: Work
comment: Collega un'istanza di Opera a un'istanza di Opera @it
comment: Links an instance of Work to an instance of Work
label: èParteDi @it

isPartOfCollection
type: ObjectProperty
domain: Manifestation
range: Collection
comment: Collega un'istanza di Manifestazione ad un'istanza di Collezione @it
comment: Links an instance of Manifestation to an instance of Collection
label: parteDiCollezione @it

isPartiallyContinuedBy
type: ObjectProperty
inverse of: partialSeveranceOrContinuationOf
domain: Manifestation
range: Manifestation
comment: Collega tra di loro due istanze di Manifestazione @it
comment: Links two instances of Manifestation to each other
label: continuataParzialmenteDa @it

isPerformanceOf
type: ObjectProperty
domain: Manifestation
range: RelationCueRecording
comment: Collega un'istanza di Manifestazione di tipo Audioregistrazione per la quale possono essere espressi dati relativi al minutaggio a un'istanza di RelazioneCue @it
comment: Links an instance of Manifestation of type Audio Recording, for which timing data can be expressed, to an instance of Cue Relationship
label: performanceDi @it

isProcessOf
type: ObjectProperty
domain: Process
range: Manifestation
comment: Collega un'istanza di Processo, inteso come processo cinematografico, a una o più istanze di Manifestazione (in particolare manifestazioni di musica per film), per indicare il loro coinvolgimento nel processo cinematografico @it
comment: Links an instance of Process, as a cinematographic process, to one or more instances of Manifestation (namely manifestations of film music), to indicate their involvement in the cinematographic process
label: processoDi @it

isProtectionMeasureOf
type: ObjectProperty
domain: Protection
range: MusicalInstrumentResource
comment: Collega una istanza di Tutela a una Risorsa Strumento Musicale @it
comment: Links an instance of Protection to a Musical Instrument Resource
label: provvedimentoTutelaDi @it

isRealisedIn
type: ObjectProperty
inverse of: realises
domain: Work
range: Expression
comment: Associa un'istanza di Opera a un'istanza di Espressione che ne è la prima e rappresentativa forma di veicolazione del contenuto @it
comment: Associates an instance of Work to an instance of Expression, which is its primary and representative form of conveying the content
label: realizzataDa @it

isReplyTo
type: ObjectProperty
sub property of: hasGeneticLinkWith
domain: Class
  union of: ArchivalResource
  union of: Manifestation
range: Class
  union of: ArchivalResource
  union of: Manifestation
comment: Collega un'istanza di Manifestazione o di Risorsa Archivistica a un'istanza di Manifestazione o di Risorsa Archivistica @it
comment: Connects an instance of Manifestation or Archival Resource to another instance of Manifestation or Archival Resource
label: rispostaDi @it

isRepresentativeExpressionOf
type: ObjectProperty
domain: Expression
range: Work
comment: Collega una Espressione ad un'Opera della quale è considerata Espressione Rappresentativa. L'Espressione Rappresentativa presenta le caratteristiche “ideali” o “canoniche” facilmente identificabili come quelle fissate nell’Espressione prima o originale dell’Opera @it
comment: Connects an Expression to a Work of which it is considered a Representative Expression. The Representative Expression presents the “ideal” or “canonical” characteristics easily identifiable as those fixed in the first or original Expression of the Work
label: espressioneRappresentativaDi @it

isResearchCampaignLinkedTo
type: ObjectProperty
sub property of: isEventLinkedTo
domain: ResearchCampaign
range: AcustemeResource
comment: Collega una Campagna di ricerca ad una Risorsa Acusteme @it
comment: Links a Research Campaign to an Acusteme Resource
label: campagnaDiRicercaCollegataA @it

isRitualEventOccasionLinkedTo
type: ObjectProperty
sub property of: isEventLinkedTo
domain: RitualEventOrOccasion
range: Class
  union of: BibliographicResource
  union of: MusicalInstrumentResource
comment: Collega uno o più eventi Rituali o Occasioni a un'istanza di Risorsa Strumento Musicale o di Risorsa Bibliografica. Un evento rituale può coinvolgere uno strumento musicale, oppure un evento rituale o un'occasione può essere il soggetto o l'argomento principale di una Risorsa Bibliografica @it
comment: Links one or more Ritual Events or Occasions to an instance of a Musical Instrument Resource or a Bibliographic Resource. A ritual event may involve a musical instrument, or a ritual event or occasion may be the subject or main topic of a Bibliographic Resource
label: eventoRitualeOccasioneCollegatoA @it

isRoleOf
type: ObjectProperty
domain: Role
range: AgentRole
comment: Collega il Ruolo ricoperto dall'Agente alla classe che esprime tale relazione. @it
comment: Links the Role performed by the Agent to the class that expresses this relation
label: ruoloDi @it

isScoreOf
type: ObjectProperty
domain: Manifestation
range: RelationCueNotatedMusic
comment: Collega un'istanza di Manifestazione di tipo Musica Scritta a un'istanza di RelazioneCue, permettendo l'espressione di dati relativi alle battute @it
comment: Links an instance of Notated Music Manifestation to an instance of Cue Relationship, allowing for the expression of data related to measures
label: partituraDi @it

isSourceInUseRelation
type: ObjectProperty
domain: Class
  union of: ArchivalResource
  union of: Manifestation
range: UseRelation
comment: Collega un'istanza di Manifestazione o di Risorsa archivistica ad un'istanza di Relazione Di Uso indicando che essa è la Sorgente o fonte di una Relazione di Uso @it
comment: Links an instance of Manifestation or Archival Resource to an instance of Use Relation, indicating that it is the Source or origin of a Use Relation
label: sorgenteNellaRelazioneDiUso @it

isSparePartOf
type: ObjectProperty
sub property of: hasLinkToInstrument
domain: MusicalInstrumentResource
range: MusicalInstrumentResource
comment: It is a component designed to replace a damaged, worn, or malfunctioning part within a system or object. A spare part is typically stored or kept on hand as part of maintenance procedures to ensure that the system or object continues to function properly when one of its parts fails
comment: È un componente progettato per sostituire una parte danneggiata, usurata o non funzionante all'interno di un sistema o oggetto. Un ricambio viene tipicamente conservato o tenuto a disposizione come parte delle procedure di manutenzione per garantire che il sistema o l'oggetto continui a funzionare correttamente quando una delle sue parti è difettosa @it
label: ricambioDi @it

isSuccessor
type: ObjectProperty
domain: Work
range: Work
comment: Collega un'istanza di Opera a un'istanza di Opera @it
comment: Links an instance of Work to an instance of Work
label: successoreDi @it

isSupplementOf
type: ObjectProperty
domain: Manifestation
range: Manifestation
comment: Collega tra di loro due istanze di Manifestazione @it
comment: Links two instances of Manifestation together
label: supplementoDi @it

isSupplementaryMaterialOf
type: ObjectProperty
domain: SupplementaryMaterial
range: Manifestation
comment: Collega gli allegati bibliografici che la completano ad una Manifestazione @it
comment: Links the bibliographic supplementary materials that complete it to a Manifestation
label: unitàAllegatoDi @it

isSupplementedOrComplementedBy
type: ObjectProperty
inverse of: supplementsOrComplements
domain: Work
range: Work
comment: Collega un'istanza di Opera a un'istanza di Opera @it
comment: Links an instance of Work to another instance of Work
label: supplementataOComplementataDa @it

isTypeOf
type: ObjectProperty
domain: Type
range: Thing
comment: Collega un Tipo, una Classificazione o specificazioni concettuali a una qualsiasi Entità che ne è descritta @it
comment: Links a Type, a Classification, or conceptual specifications to any Entity that is described by them
label: tipoDi @it

isUsedBy
type: ObjectProperty
sub property of: hasGeneticLinkWith
inverse of: uses
domain: Class
  union of: ArchivalResource
  union of: Manifestation
range: Class
  union of: ArchivalResource
  union of: Manifestation
comment: Collega un'istanza di Manifestazione o di Risorsa Archivistica a un'istanza di Manifestazione o di Risorsa Archivistica in modo generico senza possibilità di indicare il tipo di relazione d'uso @it
comment: Connects an instance of Manifestation or Archival Resource to another instance of Manifestation or Archival Resource in a generic way, without specifying the type of use relation
label: usatoDa @it

mergesWith
type: ObjectProperty
domain: Manifestation
range: Manifestation
comment: Collega tra di loro due istanze di Manifestazione @it
comment: Links two instances of Manifestation together
label: siFondeCon @it

partOf
type: ObjectProperty
domain: Manifestation
range: Manifestation
comment: Collega due Manifestazioni indicando che una di esse fa parte dell'altra @it
comment: Links two Manifestations indicating that one is part of the other
label: faParteDi @it

partialSeveranceOrContinuationOf
type: ObjectProperty
domain: Manifestation
range: Manifestation
comment: Collega tra di loro due istanze di Manifestazione @it
comment: Links two instances of Manifestation to each other
label: ScissioneOContinuazioneParzialeDi @it

precedesProcess
type: ObjectProperty
sub property of: hasRelationToProcess
domain: Process
range: Process
comment: Dà informazioni di consequenzialità temporale sui processi creativi e/o produttivi relativi alla realizzazione di una colonna sonora @it
comment: Provides temporal sequencing information about creative and/or production processes related to the creation of a soundtrack
label: precedeProcesso @it

realises
type: ObjectProperty
domain: Expression
range: Work
comment: Associa un'istanza di Espressione a un'istanza di Opera, esprimendo la relazione tra Espressione e l'Opera che essa realizza @it
comment: Associates an instance of Expression to an instance of Work, expressing the relationship between the Expression and the Work that it realises
label: realizza @it

supplementsOrComplements
type: ObjectProperty
domain: Work
range: Work
comment: Collega un'istanza di Opera a un'istanza di Opera @it
comment: Links an instance of Work to another instance of Work
label: supplementaOComplementa @it

uses
type: ObjectProperty
sub property of: hasGeneticLinkWith
domain: Class
  union of: ArchivalResource
  union of: Manifestation
range: Class
  union of: ArchivalResource
  union of: Manifestation
comment: Collega un'istanza di Manifestazione o di Risorsa Archivistica a un'istanza di Manifestazione o di Risorsa Archivistica in modo generico senza possibilità di indicare il tipo di relazione d'uso @it
comment: Connects an instance of Manifestation or Archival Resource to another instance of Manifestation or Archival Resource in a generic way, without specifying the type of use relation
label: usa @it

access
type: DatatypeProperty
domain: Class
  union of: CatalogingRecord
  union of: Media
range: Literal
comment: Indica la condizione di accesso del pubblico alla Risorsa @it
comment: Indicates the possibility of public access to the Resource
label: accesso @it

acquisition
type: DatatypeProperty
domain: Acquisition
range: Literal
comment: Indica le informazioni relative all'Acquisizione dell'Esemplare che possono essere rese pubbliche @it
comment: Indicates the information about Acquisition of the Item that can be publicly disclosed
label: acquisizione @it

acquisitionType
type: DatatypeProperty
domain: Acquisition
range: Literal
comment: Specifica la tipologia di Acquisizione, ad esempio, acquisto o donazione @it
comment: Specifies the type of Acquisition, for example, purchase or donation
label: tipoAcquisizione @it

adLibitum
type: DatatypeProperty
domain: MediumOfPerformance
range: boolean
comment: Indica se il Mezzo di Esecuzione è previsto ad libitum @it
comment: Indicates whether the Medium Of Performance is intended ad libitum

additionalLanguageCode
type: DatatypeProperty
domain: Class
  union of: BibliographicResource
  union of: Title
range: Literal
comment: Indica il Codice Aggiuntivo Lingua di una Risorsa bibliografica o di Titolo secondo le regole di catalogazione italiane @it
comment: Indicates the Additional Language Code of a bibliographic resource or title according to the Italian rules of cataloging
label: codiceAggiuntivoLingua @it

address
type: DatatypeProperty
domain: Place
range: Literal
comment: Indica l'indirizzo di una località @it
comment: Indicates the address of a location
label: indirizzo @it

administrativeDataNotes
type: DatatypeProperty
sub property of: notes
domain: MusicalInstrumentResource
range: Literal
comment: Esprime note relative alla condizione giuridica e agli altri dati amministrativi @it
comment: Expresses notes related to legal status and other administrative data
label: noteDatiAmministrativi @it

alternativeName
type: DatatypeProperty
domain: Thing
range: Literal
comment: La proprietà restituisce una stringa relativa a un nome alternativo o pseudonimo di un Agente di qualsiasi tipo. @it
comment: The property returns a string related to an alternative name or pseudonym of an Agent of any kind
label: nomeAlternativo @it

analyticalMeasurementDescription
type: DatatypeProperty
sub property of: description
domain: Measurement
range: Literal
comment: Describes in natural and human-readable language the measurement taken on an indivisible part of a musical instrument (e.g., vibrating string length; distance between holes)
comment: Descrive in linguaggio naturale e comprensibile all'umano la misurazione effettuata su una parte non divisibile di uno strumento musicale (es. lunghezza della corda vibrante; distanza tra i fori) @it
label: descrizioneMisurazioneAnalitica @it

annotations
type: DatatypeProperty
domain: MusicalInstrumentResource
range: Literal
comment: Collega a note e ulteriori informazioni relative allo Risorsa Strumento Musicale @it
comment: Links to notes and additional information related to the Musical Instrument Resource
label: annotazioni @it

appellation
type: DatatypeProperty
domain: MusicWork
range: Literal
comment: An appellation is a specific title -given to the work by the author or of common and shared use- associated with the Work Title (more generic). Its scope is to identify and disambiguate. An appellation connected to the Work Title indicates a particular Work among others with a similar Work Title, for example: Sorting Title = *Sonatas; Appellation = The devil's trill; Work Title = *Sonatas, violin, basso continuo, Bg5, G minor <The devil's trill>)
comment: Un appellativo è un titolo specifico attribuito dall'autore o di uso comune e condiviso associato al titolo dell'opera (più generico) che serve per individuare e disambiguare. Collegando un appellativo al titolo dell'Opera si intende indicare un'Opera particolare tra altre con Titolo dell'Opera simile, per esempio: Titolo di ordinamento = *Sonate; Appellativo = Il trillo del diavolo; Titolo dell'opera = *Sonate, violino, basso continuo, Bg5, sol minore <Il trillo del diavolo>) @it
label: appellativo @it

approvalDate
type: DatatypeProperty
sub property of: date
domain: CatalogingRecord
range: dateTime
comment: Indica la data in cui la scheda è stata chiusa e approvata @it
comment: Indicates the date when the record was closed and approved
label: dataApprovazione @it

assetStatus
type: DatatypeProperty
domain: MusicalInstrumentResource
range: Literal
comment: Indica lo status di collocazione dello strumento musicale (in deposito,in esposizione, in prestito...) @it
comment: Indicates the status of the musical instrument's location (in storage, on display, on loan, etc.).
label: statusDelBene @it

audioSignalNotes
type: DatatypeProperty
sub property of: notes
domain: AudioCarrier
range: Literal
comment: Esprime caratteristiche particolari del Segnale Audio del Supporto @it
comment: Expresses particular characteristics of the Audio Signal of the Carrier
label: noteSegnaleAudio @it

authorityLevel
type: DatatypeProperty
domain: CatalogingRecord
range: Literal
comment: Indica il livello di autorità per la catalogazione attribuito al catalogatore dall'ente preposto secondo le regole ICCU @it
comment: Indicates the level of authority for cataloguing attributed to the cataloguer by the body in charge according to ICCU rules
label: livelloAutorità @it

availability
type: DatatypeProperty
domain: Item
range: Literal
comment: Indica la disponibilità di un Esemplare (ad es. documento per sola consultazione interna) @it
comment: Indicates the availability of an Item (e.g., document for internal consultation only)
label: disponibilità @it

bibliography
type: DatatypeProperty
domain: Class
  union of: AcustemeResource
  union of: Agent
range: Literal
comment: Esprime indicazioni relative alla bibliografia in merito alle Risorse catalogate o agli Agenti @it
comment: Expresses information related to the bibliography concerning cataloged resources or agents
label: bibliografia @it

birthDate
type: DatatypeProperty
sub property of: date
domain: Person
range: dateTime
comment: La proprietà riguarda la data di nascita di una persona. @it
comment: The property refers to the birthdate of a person
label: dataNascita @it

collectionMemberNumber
type: DatatypeProperty
domain: CollectionMembership
range: Literal
comment: Property that allows numbering the Manifestations that are part of a Collection
comment: Proprietà che permette di numerare le Manifestazioni che fanno parte di una Collezione @it
label: numerazioneComponenteCollezione @it

compositionPlace
type: DatatypeProperty
domain: MusicWork
range: Literal
comment: Refers to the Place of composition of the representative Expression of the Work
comment: Si intende il Luogo Di Composizione dell'Espressione rappresentativa dell'Opera @it
label: luogoComposizione @it

conditionCheckingDate
type: DatatypeProperty
sub property of: date
domain: ConservationStatus
range: dateTime
comment: Data che si riferisce all'ultimo controllo di conservazione e restauri di uno strumento musicale @it
comment: Date referring to the last conservation check and restoration of a musical instrument
label: dataRilevamentoStato @it

connector
type: DatatypeProperty
domain: SupplementaryMaterial
range: Literal
comment: Collega in modo specifico più unità/allegati a una risorsa bibliografica. Ad esempio, collega alla risorsa un allegato oppure altre risorse, diverse o dello stesso tipo, che compongono una risorsa in più unità @it
comment: Specifically links several units/SupplementaryMaterial to a bibliographic resource. E.g. links a Supplementary Material to the resource or links to it other resources, of the same or different type, that make up a multi-unit resource
label: connettore @it

conservationStatusDescription
type: DatatypeProperty
sub property of: description
domain: Class
  union of: Item
  union of: MusicalInstrumentResource
range: Literal
comment: Analytical evaluation on the conservation status of a Musical Instrument Resource or a bibliographic specimen
comment: Giudizio analitico sullo stato di conservazione di una Risorsa Strumento Musicale o di un Esemplare bibliografico @it
label: descrizioneStatoConservazione @it

containerDesignationAndDimensions
type: DatatypeProperty
domain: Carrier
range: Literal
comment: Describes the container and its dimensions in natural language
comment: Descrive il contenitore e le sue dimensioni in linguaggio naturale @it
label: designazioneEDimensioniContenitore @it

contentNotes
type: DatatypeProperty
sub property of: notes
domain: Manifestation
range: Literal
comment: In questo campo si registrano l’elenco dei contenuti, le annotazioni su contenuti aggiuntivi come indici, inserti, bibliografie, lettere dedicatorie, argomento e balli per i libretti, etc. e, per le risorse monografiche in più parti, le informazioni presenti sui frontespizi successivi al primo. @it
comment: In this field, the list of contents is recorded, along with annotations on additional content such as indexes, inserts, bibliographies, dedicatory letters, topics, and dances for librettos, etc. For multi-part monographic resources, it also includes information found on title pages following the first one
label: noteContenuto @it

contextOfUse
type: DatatypeProperty
domain: MusicalInstrumentResource
range: Literal
comment: Description of the Context of Use of the instrument
comment: Descrizione del Contesto d'Uso dello strumento @it
label: contestoUso @it

cueDuration
type: DatatypeProperty
domain: CueSheetEntry
range: Literal
comment: Esprime la durata del Cue come compare nel Cue Sheet @it
comment: Expresses the duration of the Cue as it appears in the Cue Sheet
label: lunghezzaCue @it

cueM
type: DatatypeProperty
domain: CueM
range: Literal
comment: Indica il titolo del CueM @it
comment: Indicates the title of the CueM

cueMDesignation
type: DatatypeProperty
domain: CueM
range: Literal
comment: Specifica se il Cue è un M o un N @it
comment: Specifies whether the Cue is an M or an N
label: designazioneCueM @it

cueNumber
type: DatatypeProperty
domain: CueSheetEntry
range: Literal
comment: Esprime il numero progressivo del Cue all'interno del Cue Sheet @it
comment: It expresses the sequential number of the Cue within the Cue Sheet
label: numeroCue @it

cuePoint
type: DatatypeProperty
domain: CueSheetEntry
range: Literal
comment: Esprime il punto della pellicola in cui inserire il Cue @it
comment: Indicates the point in the film where the cue should be inserted

cueType
type: DatatypeProperty
domain: CueSheetEntry
range: Literal
comment: Esprime la tipologia del Cue (allo screening, titolo, azione) @it
comment: Expresses the type of Cue (for screening, title, action)
label: tipoCue @it

date
type: DatatypeProperty
domain: Thing
range: dateTime
comment: Chronological information associated with a resource, useful for its identification and contextualization
comment: Informazioni cronologiche associate a una risorsa, utili per la sua identificazione e contestualizzazione. @it
label: data @it

dateCodeType
type: DatatypeProperty
domain: Date
range: Literal
comment: Il codice indica, secondo le regole di SBN il tipo di data della pubblicazione, produzione, distribuzione, etc @it
comment: The code indicates, according to the SBN rules, the type of date for publication, production, distribution, etc
label: codiceTipoData @it

deathDate
type: DatatypeProperty
sub property of: date
domain: Person
range: dateTime
comment: La proprietà riguarda la data di morte di una persona. @it
comment: The property refers to the date of death of a person
label: dataMorte @it

depth
type: DatatypeProperty
domain: Dimensions
range: Literal
comment: Indica la dimensione della profondità del supporto @it
comment: Indicates the depth dimension of the support
label: profondità @it

description
type: DatatypeProperty
domain: Thing
range: Literal
comment: Descrizione testuale (human readable) di una risorsa o di un'entità qualsiasi @it
comment: Human-readable description of a resource or any entity
label: descrizione @it

diameter
type: DatatypeProperty
domain: Dimensions
range: Literal
comment: Indica la dimensione del diametro del supporto @it
comment: Indicates the diameter size of the carrier
label: diametro @it

dimensions
type: DatatypeProperty
domain: Dimensions
range: Literal
comment: Indica le dimensioni del supporto @it
comment: Indicates the dimensions of the Carrier
label: dimensioni @it

diplomaticTranscription
type: DatatypeProperty
domain: Inscription
range: Literal
comment: Fornisce la trascrizione diplomatica di un'Iscrizione @it
comment: Provides the diplomatic transcription of an Inscription
label: trascrizioneDiplomatica @it

editionDraftVersion
type: DatatypeProperty
domain: Manifestation
range: Literal
comment: Information about the edition (first edition, illustrated edition, etc.), version, or draft (e.g., draft...) of a resource
comment: Informazioni sulla edizione (prima edizione, edizione illustrata...), versione o stesura (abbozzo...) di una risorsa @it
label: edizioneStesuraVersione @it

endDate
type: DatatypeProperty
sub property of: date
domain: Date
range: dateTime
comment: Indica la data di fine di un'attività riferita a una risorsa @it
comment: Indicates the end date of an activity related to a resource
label: dataFine @it

endMeasureOfSource
type: DatatypeProperty
domain: UseRelation
range: Literal
comment: Last (temporal or semantic) element of a Resource; in the musical or audiovisual context, it refers to the last significant measure within a recording or a work
comment: Ultimo elemento temporale o semantico di una Risorsa; nel contesto musicale o audiovisivo, indica l'ultima misura significativa all'interno di una registrazione o di un'opera @it
label: battutaFineSorgente @it

endTimingOfSource
type: DatatypeProperty
domain: UseRelation
range: dateTime
comment: End Timing of a Source indicates the temporal point of the end of a multimedia resource (audio, video, document) in a continuous stream, measured in minutes and seconds; it is used to record the end of a segment within a resource
comment: Il Minutaggio di Fine Sorgente indica il punto temporale di fine di una risorsa multimediale (audio, video, documento) in un flusso continuo, misurato in minuti e secondi; viene utilizzato per registrare la fine di un segmento all'interno di una risorsa @it
label: minutaggioFineSorgente @it

etPassim
type: DatatypeProperty
domain: UseRelation
range: boolean
comment: Indica che un termine o concetto appare in vari punti di una risorsa senza essere associato a una sezione o localizzazione specifica. Viene impiegato per segnare, ad esempio, riferimenti sparsi in un documento o archivio @it
comment: Indicates that a term or concept appears in various parts of a resource without being associated with a specific section or location. It is used to mark, for example, scattered references in a document or archive

excerpt
type: DatatypeProperty
domain: MusicWork
range: Literal
comment: Indica l'estratto specifico di un'Opera @it
comment: Indicates the specific excerpt of a Work
label: estratto @it

extent
type: DatatypeProperty
domain: Class
  union of: Extent
  union of: Item
  union of: MusicalInstrumentResource
range: Literal
comment: Esprime la consistenza fisica di una RisorsaStrumentoMusicale o di un Esemplare di RisorsaBibliografica. E' equivalente all'estensione delle risorse bibliografiche @it
comment: Expresses the physical extent of a Musical Instrument Resource or a Bibliographic Resource Item. It is equivalent to the extent of bibliographic resources
label: consistenza @it

firstName
type: DatatypeProperty
domain: Person
range: Literal
comment: La proprietà restituisce una stringa relativa al nome proprio e primario di un Agente di tipo Persona. Ad esempio Wolfgang è il Nome Principale del compositore Wolfgang Amadeus Mozart @it
comment: The property returns a string related to the given and primary name of a Person Agent. For example, Wolfgang is the First Name of the composer Wolfgang Amadeus Mozart
label: nomePrincipale @it

format
type: DatatypeProperty
domain: Class
  union of: Extent
  union of: 3DModel
range: Literal
comment: Describes the format in which the digital or other type of resource is presented. For example, PDF, .mp3, MIDI, Ariston organetto
comment: Descrive il formato in cui la risorsa digitale o di altro tipo si presenta. Ad es. PDF, .mp3, MIDI, organetto Ariston @it
label: formato @it

groupNumber
type: DatatypeProperty
domain: Ensemble
range: Literal
comment: It refers to a sorting indication of the Ensemble indicated in the Scoring
comment: Si riferisce a un'indicazione di ordinamento dei GruppiEnsemble presenti nell'Organico @it
label: numeroGruppo @it

height
type: DatatypeProperty
domain: Dimensions
range: Literal
comment: Indica la dimensione dell'altezza del supporto @it
comment: Indicates the height dimension of the Carrier
label: altezza @it

classificationNotesHS
type: DatatypeProperty
sub property of: notes
domain: MusicalInstrumentResource
range: Literal
comment: Plain text string. It is used when there are difficulties in assigning taxa (Hornbostel Sachs)
comment: Stringa di testo. Si usa quando ci sono difficoltà nell'attribuzione dei dei taxa (Hornbostel Sachs) @it
label: noteClassificazioneHS @it

identifier
type: DatatypeProperty
domain: Thing
range: Literal
comment: La relazione collega una qualsiasi entità a una combinazione di caratteri, simboli, numeri o lettere, che identificano in modo univoco una singola istanza di un'entità all'interno di uno specifico dominio informativo. Può trattarsi anche di specifici identificatori locali. @it
comment: The relationship links any entity to a combination of characters, symbols, numbers, or letters that uniquely identify a single instance of an entity within a specific information domain. It can also refer to specific local identifiers
label: identificativo @it

inventory
type: DatatypeProperty
domain: Inventory
range: Literal
comment: Indica con una stringa il numero univoco di Inventario della risorsa catalogata @it
comment: Indicates with a string the unique inventory number of the cataloged resource
label: inventario @it

inventoryDate
type: DatatypeProperty
sub property of: date
domain: Class
  union of: Item
  union of: MusicalInstrumentResource
range: dateTime
comment: Esprime la data in cui all'oggetto in dominio è stato apposto un numero di inventario. @it
comment: Expresses the date when an inventory number was assigned to the object in the domain
label: dataInventariazione @it

isPrimary
type: DatatypeProperty
domain: Media
range: boolean
comment: Indica che il media verrà visualizzato come media principale della scheda catalografica @it
comment: Indicates that the media will be displayed as the main media of the catalog record
label: principale @it

itemFonds
type: DatatypeProperty
domain: Item
range: Literal
comment: Indica il fondo a cui appartiene l'Esemplare @it
comment: Indicates the collection to which the Item belongs
label: fondoEsemplare @it

keyword
type: DatatypeProperty
domain: Manifestation
range: Literal
comment: Associa parole chiave che esprimono i concetti rilevanti del contenuto intellettuale della risorsa @it
comment: Associates keywords that express the relevant concepts of the intellectual content of the resource
label: parolaChiave @it

labelREICAT
type: DatatypeProperty
domain: Content
range: Literal
comment: Closed vocabulary used by REICAT for content classification: (Music, Object/realia, Spoken word, interviews and oral sources, Program/software, Sounds and soundscapes, Dance and movement, Map or geographical chart, Image/photograph, Dataset/text, Other content form, Multiple content forms)
comment: Vocabolario chiuso utilizzato dalle REICAT per la classificazione dei contenuti: (Musica, Oggetto/realia, Parlato, interviste e fonti orali, Programma/software, Suoni e paesaggi sonori, Danza e movimento, Carta geografica o mappa, Immagine/fotografia, Dataset/testo, Altra forma del contenuto, Forme del contenuto multiple) @it
label: etichettaREICAT @it

legalStatus
type: DatatypeProperty
domain: Class
  union of: Item
  union of: MusicalInstrumentResource
range: Literal
comment: Information related to the legal status according to Italian law
comment: Informazioni relative alla condizione giuridica secondo l'ordinamento italiano @it
label: condizioneGiuridica @it

legislativeMeasureType
type: DatatypeProperty
domain: Protection
range: Literal
comment: Esprime il decreto legislativo relativo al provvedimento di Tutela @it
comment: Expresses the legislative decree related to the Protection act
label: tipoProvvedimento @it

level
type: DatatypeProperty
domain: Damage
range: integer
comment: Esprime il livello di consistenza del Danno individuato (stato di conservazione) @it
comment: Expresses the level of severity of the detected damage (conservation status)
label: livello @it

literaryOrOralIncipit
type: DatatypeProperty
domain: Title
range: boolean
comment: Esprime se il Titolo (o la Variante del titolo) sono un incipit letterario o di forma orale @it
comment: Indicates whether the Title (or the Variant Title) is a literary or oral form incipit
label: incipitLetterarioODiFormaOrale @it

localName
type: DatatypeProperty
domain: Class
  union of: Carrier
  union of: MusicalInstrumentResource
  union of: Process
  union of: UseRelation
range: Literal
comment: Plain text string that expresses the local name in natural language
comment: Stringa di testo libero che esprime la denominazione locale in linguaggio naturale @it
label: denominazioneLocale @it

location
type: DatatypeProperty
domain: RepresentationOrRecording
range: Literal
comment: Indica il collegamento con la città o la località @it
comment: Indicates the connection with the city or location
label: località @it

m3DResolution
type: DatatypeProperty
domain: 3DModel
range: Literal
comment: Indica la tipologia della risoluzione @it
comment: Indicates the type of resolution
label: risoluzioneM3D @it

mainLabel
type: DatatypeProperty
domain: CueSheetEntry
range: Literal
comment: Label associata a una Voce di Cue sheet @it
comment: Label associated with a Cue Sheet Entry
label: etichettaPrincipale @it

majorValue
type: DatatypeProperty
domain: Beacons
range: Literal
comment: An integer (16-bit) used to further divide a system of beacons identified by a certain UUID. It often represents a zone, floor, or area within a building
comment: Un numero intero (16-bit) utilizzato per suddividere ulteriormente un sistema di beacons identificati da un certo UUID. Spesso rappresenta una zona, un piano, o un'area all'interno di un edificio @it

material
type: DatatypeProperty
domain: Carrier
range: Literal
comment: Descrizione in linguaggio naturale del materiale di cui è fatto il Supporto @it
comment: Natural language description of the material the Carrier is made of
label: materiale @it

materialAndExtentDesignation
type: DatatypeProperty
domain: Class
  union of: ArchivalResource
  union of: Manifestation
  union of: SupplementaryMaterial
range: Literal
comment: Records the extent of the resource by providing the number of physical or digital entities in Arabic numerals and the unit of measurement. Describes the medium of the resource
comment: Registra l'estensione e la consistenza della risorsa fornendo il numero di entità fisiche o digitali in numeri arabi e l'unità di misurazione. Descrive il medium della risorsa @it
label: designazioneMaterialeEdEstensione @it

materialsAndTechniquesDescription
type: DatatypeProperty
sub property of: description
domain: MusicalInstrumentResource
range: Literal
comment: Fornisce informazioni sul Materiale di cui è costituita la Risorsa Strumento Musicale e/o sulle tecniche impiegate per la sua costruzione @it
comment: Provides information on the material of which the Musical Instrument Resource is made and/or the techniques used for its construction
label: descrizioneMaterialiETecniche @it

measurement
type: DatatypeProperty
domain: Measurement
range: Literal
comment: Esprime il valore della Misurazione Analitica @it
comment: Expresses the value of the Measurement
label: misura @it

measurementDescription
type: DatatypeProperty
sub property of: description
domain: MusicalInstrumentResource
range: Literal
comment: Describes in natural and human-readable language the measurement taken on a musical instrument
comment: Descrive in linguaggio naturale e comprensibile all'umano la misurazione effettuata su uno strumento musicale @it
label: descrizioneMisure @it

measurementQuality
type: DatatypeProperty
domain: Measurement
range: Literal
comment: Esprime la qualità della Misurazione Analitica che può avere un valore approssimato, esatto o medio @it
comment: It expresses the quality of the Measurement, which can have an approximate, exact, or average value
label: qualitàMisurazione @it

mediaType
type: DatatypeProperty
domain: Media
range: Literal
comment: Collega un'istanza di Media a una tipologia (Tipo) @it
comment: Links an instance of Media to a Type
label: tipoMedia @it

mibactProtectionScope
type: DatatypeProperty
domain: Protection
range: Literal
comment: Esprime l'ambito di tutela Mibact (etnoantropologico, storico-artistico...) @it
comment: Expresses the scope of Mibact protection (ethno-anthropological, historical-artistic, etc.)
label: ambitoTutelaMibact @it

middleName
type: DatatypeProperty
domain: Person
range: Literal
comment: La proprietà restituisce una stringa relativa al secondo nome di un Agente di tipo Persona. Ad esempio Amadeus è il Secondo Nome del compositore Wolfgang Amadeus Mozart @it
comment: The property returns a string related to the middle name of an Agent of type Person. For example, Amadeus is the Middle Name of the composer Wolfgang Amadeus Mozart
label: secondoNome @it

minorValue
type: DatatypeProperty
domain: Beacons
range: Literal
comment: An integer (16-bit) that provides further granularity within the Major value. It can represent a specific beacon within a given area
comment: Un numero intero (16-bit) che fornisce un'ulteriore granularità all'interno del valore Major. Può rappresentare un beacon specifico all'interno di una determinata zona @it

musicCue
type: DatatypeProperty
domain: CueSheetEntry
range: Literal
comment: Esprime il titolo del brano di riferimento del Cue come è espresso nel Cue Sheet @it
comment: Expresses the title of the reference track of the Cue as it appears in the Cue Sheet

name
type: DatatypeProperty
domain: Thing
range: Literal
comment: La proprietà restituisce una stringa relativa all'etichetta di un'entità @it
comment: The property returns a string related to the label of an entity
label: nome @it

nameType
type: DatatypeProperty
domain: LocalName
range: Literal
comment: Refers to the possibility that the local name associated with the instrument is alternative to another name, whether it is an incorrect attribution of a name ( for example, a name given for exhibition or inventory) or the original name
comment: Si riferisce alla possibilità che la Denominazione locale associata allo Strumento sia alternativa ad un'altra denominazione, sia l'attribuzione errata di una denominazione (data,ad esempio, in sede di esposizione o di inventario) oppure sia la denominazione originaria @it
label: tipoDenominazione @it

nature
type: DatatypeProperty
domain: Manifestation
range: Literal
comment: Esprime la Natura della risorsa bibliografica (Manifestazione) in base alle regole italiane di catalogazione (REICAT). In particolare esprime se la Manifestazione è una Monografia (M), un Seriale (S), un elemento di spoglio (N), una monografia senza titolo significativo (W) @it
comment: Expresses the nature of the bibliographic resource (Manifestation) based on Italian cataloging rules (REICAT). Specifically, it indicates whether the Manifestation is a Monograph (M), a Serial (S), an analitical entry (N), or a monograph without a significant title (W)
label: natura @it

nonSignificantTitle
type: DatatypeProperty
domain: SortingTitle
range: boolean
comment: Indica il Titolo non significativo dell'Opera @it
comment: Indicates the non-significant title of the Work
label: titoloNonSignificativo @it

notes
type: DatatypeProperty
domain: Thing
range: Literal
comment: Questa proprietà è utile per fornire informazioni aggiuntive associate a una risorsa @it
comment: This property is useful for providing additional information associated with a resource
label: note @it

number
type: DatatypeProperty
domain: Extent
range: integer
comment: Specifica il numero di componenti della risorsa. Es. 2 volumi, 4 cartelle... @it
comment: Specifies the number of components of the resource. E.g. 2 volumes, 4 folders...
label: numero @it

numberOfMoP
type: DatatypeProperty
domain: MediumOfPerformance
range: integer
comment: It refers to the quantity (number) of Mediums of Performance
comment: Si riferisce alla quantità (numero) di Mezzi di Esecuzione @it
label: numeroElementi @it

numberOfPerformers
type: DatatypeProperty
domain: Ensemble
range: integer
comment: Indica il numero di esecutori necessari per il gruppo strumentale (Ensemble) indicato. Sostituisce l'indicazione ICCU: "2perc(tom,tambmil,timp,gc,tbl,3pts,pt,vibr)", dove si intende che due strumentisti usano tutti strumenti specificato in parentesi @it
comment: Indicates the number of performers required for the indicated Ensemble. It replaces the ICCU notation: "2perc(tom,tambmil,timp,gc,tbl,3pts,pt,vibr)", where it means that two musicians use all the instruments specified in parentheses
label: numeroEsecutori @it

occasionOfRepresentation
type: DatatypeProperty
domain: RepresentationOrRecording
range: Literal
comment: Indica il collegamento a un evento non riconducibile a una festività generale, civile o religiosa, ma a una festività locale (p.es. il Santo Patrono) @it
comment: Indicates the connection to an event that is not related to a general, civil, or religious holiday, but to a local celebration (e.g., the patron saint's day)
label: occasioneRappresentazione @it

otherSources
type: DatatypeProperty
domain: MusicWork
range: Literal
comment: Indica fonti utilizzate per la descrizione dell'Opera @it
comment: Indicates sources used for the description of the Work
label: altreFonti @it

otherTitle
type: DatatypeProperty
domain: VariantTitle
range: Literal
comment: Esprime un titolo variante rispetto al titolo principale sotto forma di stringa di testo @it
comment: Expresses an alternative title compared to the main title in the form of a text string
label: altroTitolo @it

overdub
type: DatatypeProperty
domain: MediumOfPerformance
range: boolean
comment: Indica se è previsto che il Mezzo di Esecuzione menzionato in partitura sia da registrare come overdub @it
comment: Indicates whether the Medium of Performance mentioned in the score is to be recorded as an overdub

partVoiceSection
type: DatatypeProperty
domain: MediumOfPerformance
range: Literal
comment: Indica di quale sezione fa parte il Mezzo di Esecuzione o qual è la parte eseguita o quali voci compongono un ensemble corale. Per esempio Violini I, fl.2, SATB @it
comment: Indicates which section the Medium of Performance belongs to, which part is performed, or which voices make up a choral ensemble. For example, Violins I, fl.2, SATB
label: sezioneParteVoci @it

periodOfRepresentation
type: DatatypeProperty
domain: RepresentationOrRecording
range: Literal
comment: Indica, con la denominazione moderna, il Periodo della Rappresentazione o Registrazione. Con periodo si intende il mese, il giorno o la stagione (per es. Carnevale o Autunno) o una festività generale, civile o religiosa (ad es. Natale) @it
comment: Indicates, with the modern denomination, the period of the representation or recording. The period refers to the month, day, or season (e.g., Carnival or Autumn) or a general, civil, or religious holiday (e.g., Christmas)
label: periodoRappresentazione @it

placeOfUseNotes
type: DatatypeProperty
sub property of: notes
domain: MusicalInstrumentResource
range: Literal
comment: Note riguardo al luogo nel quale viene utilizzato lo strumento musicale descritto @it
comment: Notes regarding the place where the described musical instrument is used
label: noteLuogoUso @it

placementDate
type: DatatypeProperty
sub property of: date
domain: Identifier
range: dateTime
comment: Data relativa all'apposizione di specifici identificativi che lo richiedono @it
comment: Date related to the placement of specific identifiers that require it
label: dataApposizione @it

playFromBar
type: DatatypeProperty
domain: RelationCueNotatedMusic
range: Literal
comment: Esprime la battuta di inizio del taglio (Cue) @it
comment: Indicates the starting bar of the Cue
label: suonaDaBattuta @it

playFromMin
type: DatatypeProperty
domain: RelationCueRecording
range: dateTime
comment: Esprime l'inizio del taglio (Cue) della registrazione @it
comment: Indicates the start of the Cue within the recording
label: suonaDaMin @it

playUntil
type: DatatypeProperty
domain: CueSheetEntry
range: Literal
comment: Indicates the point up to which a cue should continue, often referring to a repetition or a specific section of the score
comment: Indicazione che stabilisce il punto fino al quale un cue deve proseguire, spesso in riferimento a una ripetizione o a una sezione specifica dello spartito @it

playUntilBar
type: DatatypeProperty
domain: RelationCueNotatedMusic
range: Literal
comment: Esprime la battuta di fine del taglio (Cue) @it
comment: Indicates the ending bar of the Cue
label: suonaFinoABattuta @it

playUntilMin
type: DatatypeProperty
domain: RelationCueRecording
range: dateTime
comment: Esprime la fine del taglio (Cue) della registrazione @it
comment: Indicates the end of the Cue within the recording
label: suonaFinoAlMin @it

position
type: DatatypeProperty
domain: Inscription
range: Literal
comment: Indica la posizione dell'Iscrizione sulla Risorsa Strumento Musicale @it
comment: Indicates the position of the Inscription on the Musical Instrument Resource
label: posizione @it

postalCode
type: DatatypeProperty
domain: Place
range: Literal
comment: Indica il codice di avviamento postale di una località @it
comment: Indicates the postal code of a location
label: cap @it

preparatoryMaterial
type: DatatypeProperty
domain: Manifestation
range: boolean
comment: Distingue le risorse che possono rientrare nella classificazione WEMI da quelle che non possono o non vogliono essere fatte rientrare in tale classificazione @it
comment: Distinguish resources that can be included in the WEMI classification from those that cannot or are not willing to be included in that classification.
label: materialePreparatorio @it

productionPlanAndProcess
type: DatatypeProperty
domain: Manifestation
range: Literal
comment: Esprime se la Risorsa è o non è pubblicata @it
comment: Indicates whether the Resource is published or not
label: pianoEProcessoProduttivo @it

protectiveMeasure
type: DatatypeProperty
domain: Protection
range: Literal
comment: Esprime la presenza o l'assenza di un atto giuridico o amministrativo che garantisce la protezione e la conservazione di beni archivistici di interesse storico o culturale o la non disponibilità del dato @it
comment: Expresses the presence or absence of a legal or administrative act that ensures the protection and preservation of archival assets of historical or cultural interest, or the unavailability of the data
label: provvedimentoTutela @it

publicationProductionDistribution
type: DatatypeProperty
domain: Manifestation
range: Literal
comment: Information about the publication, production, or distribution of a resource
comment: Informazioni sulla pubblicazione, produzione o distribuzione di una risorsa @it
label: pubblicazioneProduzioneDistribuzione @it

recordSource
type: DatatypeProperty
domain: CatalogingRecord
range: Literal
comment: Indica la fonte dalla quale sono stati tratti i dati per compilazione della Scheda catalografica @it
comment: It indicates the source from which the data for compiling the cataloging record were taken
label: rilevamento @it

reel
type: DatatypeProperty
domain: CueM
range: integer
comment: Indica il numero del rullo cinematografico @it
comment: Indicates the film reel number
label: rullo @it

rendering
type: DatatypeProperty
domain: 3DModel
range: Literal
comment: Indica quale tipologia di Risorsa Strumento Musicale è rappresentata (parti multiple strumento, parte di strumento, strumento completo, strumento completo con parte o parti) @it
comment: It indicates the type of Musical Instrument Resource represented (multiple parts of the instrument, part of the instrument, complete instrument, complete instrument with part or parts)
label: rappresentazione @it

representationGenre
type: DatatypeProperty
domain: RepresentationOrRecording
range: Literal
comment: Indica il collegamento tra la Rappresentazione o Registrazione e la sua tipologia attraverso un vocabolario chiuso @it
comment: Indicates the link between the Representation or Recording and its Type through a controlled vocabulary
label: genereRappresentazione @it

restorationDescription
type: DatatypeProperty
sub property of: description
domain: Class
  union of: Item
  union of: MusicalInstrumentResource
range: Literal
comment: Description related to the type and methods of restoration interventions carried out on a Musical Instrument Resource or a bibliographic Item
comment: Descrizione relativa alla tipologia e alle modalità di intervento di restauro che sono state fatte su una Risorsa Strumento Musicale o su un Esemplare bibliografico @it
label: descrizioneRestauri @it

scale
type: DatatypeProperty
domain: 3DModel
range: Literal
comment: Indica la scala del modello @it
comment: Indicates the scale of the model
label: scala @it

scanType
type: DatatypeProperty
domain: 3DModel
range: Literal
comment: Indica la tipologia della scansione di un MediaModelli3D @it
comment: Indicates the type of scan for a Media 3D Models
label: tipologiaScansione @it

scoringSummary
type: DatatypeProperty
domain: Class
  union of: Expression
  union of: MusicWork
range: Literal
comment: Indica l'Organico Sintetico secondo le regole di SBN musica @it
comment: Indicates the scoring with abbreviated and coded acronyms according to the Italian SBN-Musica rules
label: organicoSintetico @it

sections
type: DatatypeProperty
domain: MusicWork
range: Literal
comment: Indica il numero di sezioni o parti in cui è suddiviso un brano musicale, utile per distinguere differenti versioni o strutture della composizione @it
comment: Indicates the number of sections or parts into which a musical piece is divided, useful for distinguishing different versions or structures of the composition
label: sezioni @it

segmentEnd
type: DatatypeProperty
domain: Segmentation
range: dateTime
comment: Indicazione temporale di fine del segmento @it
comment: Time indication for the end of the segment
label: fineSegmento @it

segmentNumber
type: DatatypeProperty
domain: Segmentation
range: Literal
comment: Indica il numero di ordinamento attribuito al segmento @it
comment: Indicates the order number assigned to the segment
label: numeroSegmento @it

segmentStart
type: DatatypeProperty
domain: Segmentation
range: dateTime
comment: Indicazione temporale di inizio del segmento @it
comment: Time indication for the start of the segment
label: inizioSegmento @it

segmentTitle
type: DatatypeProperty
domain: Segmentation
range: Literal
comment: Indica il titolo attribuito al segmento @it
comment: Indicates the title assigned to the segment
label: titoloSegmento @it

sensorySpecification
type: DatatypeProperty
domain: Content
range: Literal
comment: Esprime il senso attraverso il quale è espresso il contenuto della Manifestazione catalogata (Visivo, Uditivo, Olfattivo, Tattile, Gustativo) @it
comment: Expresses the sense through which the content of the cataloged Manifestation is conveyed (Visual, Auditory, Olfactory, Tactile, Gustatory)
label: specificazioneSensoriale @it

shelfMark
type: DatatypeProperty
domain: ShelfMark
range: Literal
comment: Free text string that expresses the ShelfMark
comment: Stringa di testo libero che esprime la collocazione @it
label: segnatura @it

shelfMarkingDate
type: DatatypeProperty
sub property of: date
domain: CurrentShelfMark
range: dateTime
comment: Indica la data in cui un oggetto ha ricevuto la sua attuale collocazione. @it
comment: Indicates the date when an object received its current ShelfMark
label: dataCollocazione @it

signalQuality
type: DatatypeProperty
domain: AudioCarrier
range: Literal
comment: Esprime la Qualità del Segnale di un supporto audio analogico @it
comment: It expresses the quality of the signal of an analog Audio Carrier
label: qualitàSegnale @it

site
type: DatatypeProperty
domain: RepresentationOrRecording
range: Literal
comment: Indica il collegamento con il nome del teatro, del palazzo, della sala, ecc.. @it
comment: Indicates the connection with the name of the theater, palace, hall, etc
label: sede @it

solo
type: DatatypeProperty
domain: MediumOfPerformance
range: boolean
comment: Indica se il Mezzo di Esecuzione è solista @it
comment: Indicates whether the Medium of Performance is a soloist

sortingNumber
type: DatatypeProperty
domain: MusicWork
range: Literal
comment: Indica il Numero d'Ordine di un'Opera Musica @it
comment: Indicates the Sorting Number of a MusicWork
label: numeroOrdine @it

sortingTitle
type: DatatypeProperty
domain: SortingTitle
range: Literal
comment: Indica il Titolo di ordinamento dell'Opera @it
comment: Indicates the Sorting title of the Work
label: titoloOrdinamento @it

specificDesignation
type: DatatypeProperty
domain: Extent
range: Literal
comment: Specifica il tipo di Supporti che costituiscono la Risorsa. Ad esempio pagine, volumi, CD @it
comment: Specifies the type of Carrier that make up the Resource, e.g., pages, volumes, CDs
label: designazioneSpecifica @it

startDate
type: DatatypeProperty
sub property of: date
domain: Date
range: dateTime
comment: Indica la data di inizio di un'attività riferita a una risorsa @it
comment: Indicates the start date of an activity related to a resource
label: dataInizio @it

startMeasureOfDestination
type: DatatypeProperty
domain: UseRelation
range: Literal
comment: Refers to the first temporal or semantic element of a resource when it is transferred or used in a new context; it can, for example, represent the first significant event in a new version or copy of a work
comment: Si riferisce al primo elemento temporale o semantico di una Risorsa quando viene trasferita o utilizzata in un nuovo contesto; può, ad esempio, rappresentare il primo evento significativo in una nuova versione o copia di un'opera @it
label: battutaInizioDestinazione @it

startMeasureOfSource
type: DatatypeProperty
domain: UseRelation
range: Literal
comment: First temporal or semantic element of a resource; in the musical or audiovisual context, it indicates the first significant measure within a recording or a work
comment: Primo elemento temporale o semantico di una Risorsa; nel contesto musicale o audiovisivo, indica la prima misura significativa all'interno di una registrazione o di un'opera @it
label: battutaInizioSorgente @it

startTimingOfDestination
type: DatatypeProperty
domain: UseRelation
range: dateTime
comment: Indica il minutaggio di inizio in una destinazione al nel quale è inserito il materiale Sorgente, come una registrazione finale o un'altra versione dell'Opera @it
comment: Indicates the timing where a Source material is placed in a Destination, such as a final recording or another version of the Work
label: minutaggioInizioDestinazione @it

startTimingOfSource
type: DatatypeProperty
domain: UseRelation
range: dateTime
comment: Minutaggio di inizio sorgente indica il punto temporale di inizio di una risorsa multimediale (audio, video, documento) in un flusso continuo, misurato in minuti e secondi; viene utilizzato per registrare l'inizio di un segmento all'interno di una risorsa @it
comment: Start Timing of Source indicates the temporal point of the beginning of a multimedia resource (audio, video, document) in a continuous stream, measured in minutes and seconds; it is used to track the beginning of a segment within a resource
label: minutaggioInizioSorgente @it

status
type: DatatypeProperty
domain: CatalogingRecord
range: Literal
comment: Indica lo stato della Scheda catalografica (nuova, bozza, approvato) @it
comment: The property indicates the status of the catalog card (new, draft, approved)
label: stato @it

subtitle
type: DatatypeProperty
domain: VariantTitle
range: Literal
comment: A secondary textual element associated with a main title, serving an explanatory or supplementary function
comment: Elemento testuale secondario associato a un titolo principale, con funzione esplicativa o integrativa @it
label: sottotitolo @it

suffix
type: DatatypeProperty
domain: MediumOfPerformance
range: Literal
comment: Fornisce specificazioni sulle modalità performative del Mezzo di Esecuzione. Per esempio "a quattro mani", "amplificato", "due esecutori", "preparato" @it
comment: Provides specifications on the performative modes of the Medium of Performance. For example, "four hands," "amplified," "two performers," "prepared
label: suffisso @it

surname
type: DatatypeProperty
domain: Person
range: Literal
comment: La proprietà restituisce una stringa relativa al cognome di un Agente di tipo Persona. @it
comment: The property returns a string related to the surname of an Agent of type Person
label: cognome @it

tapeWidth
type: DatatypeProperty
domain: Carrier
range: Literal
comment: Indica la dimensione della larghezza del nastro @it
comment: Indicates the width dimension of the tape
label: larghezzaNastro @it

thematicCatalogNumber
type: DatatypeProperty
domain: MusicWork
range: Literal
comment: Indica il Numero di Catalogo Tematico di un'Opera Musica @it
comment: Indicates the thematic catalog number of a Music Work
label: numeroCatalogoTematico @it

title
type: DatatypeProperty
domain: Class
  union of: BibliographicResource
  union of: BibliographyDiscographyOrFilmography
  union of: 3DModel
range: Literal
comment: A plain text string that identifies in natural language and human-readable form any bibliographic resource
comment: Stringa di testo che identifica in linguaggio naturale e leggibile dall'umano una Risorsa bibliografica qualsiasi. @it
label: titolo @it

titleNature
type: DatatypeProperty
domain: VariantTitle
range: Literal
comment: Indica la natura di un titolo assegnato a un'entità culturale, documentale o archivistica. Specifica casi in cui è presente un titolo alternativo, attribuito, tradotto, abbreviato o convenzionale @it
comment: Indicates the nature of a title assigned to a cultural, documentary, or archival record. Specifies cases where there is an alternative title, attributed, translated, abbreviated, or conventional title
label: naturaTitolo @it

totalScoring
type: DatatypeProperty
domain: Class
  union of: Expression
  union of: MusicWork
range: Literal
comment: Indica l'Organico Analitico secondo le regole di SBN musica, espresso con sigle e numeri che corrispondono agli strumenti e al numero di sezioni degli strumenti @it
comment: Indicates the Total Scoring according to SBN music rules, expressed with abbreviations and numbers corresponding to the instruments and the number of sections of the instruments
label: organicoAnalitico @it

typeOfUseDescription
type: DatatypeProperty
sub property of: description
domain: UseRelation
range: Literal
comment: It refers to the documentation of the ways in which a cultural object is used in a specific context, such as in conservation, enjoyment, or research; it categorizes the functions or roles of an object in relation to the activities or events in which it is involved.
comment: Si riferisce alla documentazione delle modalità con cui un oggetto culturale viene utilizzato in un contesto specifico, come nella conservazione, fruizione, o ricerca; vi categorizzano le funzioni o i ruoli di un oggetto in relazione alle attività o agli eventi in cui è coinvolto @it
label: descrizioneTipoUso @it

useRelationType
type: DatatypeProperty
domain: UseRelation
range: Literal
comment: Specifica il tipo di relazione funzionale tra un'entità e il suo utilizzo in un determinato contesto. @it
comment: Specifies the type of functional relationship between an entity and its use in a specific context
label: tipoRelazioneUso @it

uuid
type: DatatypeProperty
domain: Beacons
range: Literal
comment: String of a universally unique identifier (UUID) linked to Beacons
comment: Stringa di identificativo univoco universale (Universally Unique Identifier) collegata a Beacons @it

weight
type: DatatypeProperty
domain: Dimensions
range: Literal
comment: Indica la dimensione del peso del supporto della Risorsa Bibliografica o della Risorsa Strumento Musicale @it
comment: Indicates the weight of the Carrier of the Bibliographic Resource or the Musical Instrument Resource
label: peso @it

width
type: DatatypeProperty
domain: Dimensions
range: Literal
comment: Indica la dimensione della larghezza del supporto @it
comment: Indicates the width dimension of the Carrier
label: larghezza @it

workNumber
type: DatatypeProperty
domain: MusicWork
range: Literal
comment: Indica il Numero di catalogo (Numero d'opera) di un Opera Musica @it
comment: Indicates the Catalogue Number (Work Number) of a Music Work
label: numeroOpera @it

ACNP
type: Class
subclass of: Identifier
comment: Archivio Collettivo Nazionale dei Periodici. Sistema di id gestito da SBN per la catalogazione di pubblicazioni periodiche. @it
comment: National Collective Archive of Periodicals. An identifier system managed by SBN for the cataloging of periodical publications

AFSEthnographicThesaurus
type: Class
subclass of: Type
comment: A controlled vocabulary that describes ethnographic and folkloric materials in a standardized way. It was developed by the American Folklore Society (AFS) in collaboration with the Library of Congress
comment: Vocabolario controllato che descrivere in modo standardizzato materiali etnografici e folklorici. È stato sviluppato dall'American Folklore Society (AFS) in collaborazione con la Library of Congress @it

Acquisition
type: Class
comment: Acquisition of a museum item by the conserving institution, described using a controlled vocabulary and a date
comment: Acquisizione di un bene museale da parte dell'ente conservatore, descritta attraverso un vocabolario chiuso e una data @it
label: Acquisizione @it

AcustemeResource
type: Class
comment: Cataloging description unit
comment: Unità di descrizione catalografica @it
label: RisorsaAcusteme @it

Agent
type: Class
comment: Entity capable of acting or exerting influence in the world. It can be a person, a group of people, a family, an organization that makes decisions and acts intentionally, but also software or an entity of any other nature capable of causing changes or performing actions
comment: Entità capace di agire o di esercitare un'influenza nel mondo. Può essere una persona, un gruppo di persone, una famiglia, un'organizzazione, che prende decisioni e agisce intenzionalmente, ma anche un software o un'entità di qualsiasi altra natura in grado di causare cambiamenti o compiere azioni @it
label: Agente @it

AgentRole
type: Class
comment: Descrive il ruolo che un Agente assume rispetto a un'attività o una risorsa @it
comment: It describes the role that an Agent assumes with respect to an activity or a resource
label: RuoloAgente @it

Annotation
type: Class
subclass of: EthnomusicologicalResourceType
comment: Analytical information added to an existing document
comment: Informazioni analitiche aggiunte a un documento esistente @it
label: Annotazione @it

Appellation
type: Class
comment: Questa classe include segni, significativi o meno, o una combinazione di segni che seguono una sintassi specifica, usati o utilizzabili per riferirsi e identificare una certa classe o categoria in un dato contesto @it
comment: This class includes signs, whether meaningful or not, or combinations of signs that follow a specific syntax, used or usable to refer and identify a specific instance of a certain class or category in a given context
label: Appellativo @it

ArchivalResource
type: Class
subclass of: AcustemeResource
comment: Comprende tutte le risorse di tipo archivistico così come descritte dal CM RIC di ICA @it
comment: It includes all archival resources as described by the CM RIC of ICA
label: RisorsaArchivistica @it

Area
type: Class
subclass of: Place
comment: Area o regione, non necessariamente corrispondente a confini geografici o convenzionali, all'interno della quale è distribuito un fenomeno culturale, un gruppo umano o una specie animale, un processo organico o inorganico, o altro @it
comment: Area or region, not necessarily corresponding to geographical or conventional boundaries, within which a cultural phenomenon, a human group or an animal species, an organic or inorganic process, or something else is distributed
label: Areale @it

ArtAndArchitectureThesaurus
type: Class
subclass of: Type
comment: A controlled vocabulary developed by the Getty Research Institute, used to describe and catalog works of art, architecture, cultural artifacts, and other materials related to cultural heritage
comment: Vocabolario controllato sviluppato dal Getty Research Institute, utilizzato per descrivere e catalogare opere d'arte, architettura, manufatti culturali e altri materiali relativi al patrimonio culturale. @it

AudioCarrier
type: Class
subclass of: Carrier
comment: Carrier that contain sound recordings, reproducible through appropriate audio devices (such as turntables, CD players, or cassette players). They can be either analog (e.g., vinyl, audio cassette) or digital (e.g., audio CD, audio files on electronic media)
comment: Supporti che contengono registrazioni sonore, riproducibili attraverso appropriati dispositivi audio (come giradischi, lettori CD o lettori di cassette). Possono essere sia di tipo analogico (es. vinile, audiocassetta) sia di tipo digitale (es. CD audio, file audio su supporto elettronico) @it
label: SupportiAudio @it

AudioMedia
type: Class
subclass of: Media
comment: Audio media files linked to resources in various formats (e.g., AIFF, WAV, MIDI, MP4...)
comment: File media di tipo audio collegati alle risorse e in diverso formato (es, AIFF, WAV, MIDI, MP4...) @it
label: MediaAudio @it

BNI
type: Class
subclass of: Identifier
comment: Bibliografia Nazionale Italiana @it
comment: Italian National Bibliography

Beacons
type: Class
subclass of: Identifier
comment: Identificatori sfruttati nell'ambito delle tecnologie Bluetooth e utilizzati per esperienze di realtà aumentata @it
comment: Identifiers used within Bluetooth technologies and employed for augmented reality experiences

BibliographicResource
type: Class
subclass of: AcustemeResource
comment: Objects of the real world that can be documented from a bibliographic perspective and their connected abstractions related to the WEMI model
comment: Oggetti del reale documentabili dal punto di vista bibliografico e le loro astrazioni riconducibili al modello WEMI @it
label: RisorsaBibliografica @it

BibliographyDiscographyOrFilmography
type: Class
comment: Class that expresses a list of external resources linked via URL to the cataloged resource
comment: Classe che esprime un elenco di risorse esterne collegate tramite URL alla Risorsa catalogata @it
label: BibliografiaODiscografiaOFilmografia @it

CUBI
type: Class
subclass of: Identifier
comment: Catalogo Unico delle Biblioteche Italiane. Sistema di catalogazione centralizzato @it
comment: Union Catalog of Italian Libraries. A centralized cataloging system

Carrier
type: Class
comment: A carrier is a physical or digital means that conveys, stores, and makes accessible the informational content of a resource, determining its material, virtual, or technological format, and the methods of use. For example, a vinyl record, an online resource, a VHS, a microfiche
comment: Un supporto è un mezzo fisico o digitale che veicola, conserva e rende accessibile il contenuto informativo di una risorsa, determinandone il formato materiale, virtuale o tecnologico, e le modalità di fruizione. Ad esempio un disco in vinile, una risorsa online, un VHS, un microfiche @it
label: Supporto @it

CartographyWork
type: Class
subclass of: Work
comment: Opera che rappresentano la Terra, in tutto o in parte, un corpo celeste o un luogo immaginario a qualsiasi scala. @it
comment: Works that represent the Earth, in whole or in part, a celestial body, or an imaginary place at any scale
label: OperaCartografia @it

CatalogingCampaign
type: Class
subclass of: Event
comment: Event in which a continuous cataloging activity has been carried out by one or more Agents
comment: Evento nel quale è stata portata avanti un'attività continuativa di catalogazione da uno o più Agenti @it
label: CampagnaDiCatalogazione @it

CatalogingRecord
type: Class
comment: Class that includes instances related to the cataloging records of the entities in the Acusteme system
comment: Classe che comprende le istanze relative alle Schede di catalogazione delle entità presenti nel sistema Acusteme @it
label: SchedaCatalografica @it

Collection
type: Class
subclass of: Work
comment: Class that includes collective Works, such as Serials, or other works conceived and planned to result in a sequence of connected Expressions and Manifestations
comment: Classe che comprende Opere di tipo collettaneo che raccolgono cioè Seriali oppure altre opere ma pensate e pianificate per risultare in una sequenza di Espressioni e Manifestazioni collegate @it
comment: Possibile allineamento con: LRMoo-Pressoo: F18: Serial Work @it
label: Collezione @it

CollectionMembership
type: Class
subclass of: Relation
comment: Classe funzionale che collega una Manifestazione a una Collezione alla quale appartiene tramite le proprietà: acu:èComponenteCollezione/acu:èManifestazioneNellaCollezione, acu:haComponenteCollezione/acu:èCollezioneDi @it
comment: Functional class that links a Manifestation to a Collection to which it belongs through the properties acu:isCollectionMember/acu:isMemberInCollection and acu:hasCollectionMember/acu:isCollectionOf
label: ComponenteCollezione @it

ConservationStatus
type: Class
comment: Informazioni relative allo stato di conservazione di un oggetto materiale @it
comment: Pieces of information regarding the condition of a physical object
label: StatoDiConservazione @it

ConservationStatusType
type: Class
subclass of: Type
comment: Esprime in modo generico la condizione di un oggetto materiale (Buono, cattivo, decente, discreto, mediocre) @it
comment: Generically expresses the condition of a material object (Good, bad, fair, decent, mediocre)
label: TipoDiStatoDiConservazione @it

Content
type: Class
subclass of: Type
comment: A class that contains terms used to indicate the main content and media aspects of resources
comment: Classe che contiene termini con i quali si indicano i principali aspetti contenutistici e mediali delle risorse @it
label: Contenuto @it

CorporateBody
type: Class
subclass of: Group
comment: An organized group of people acting together as an Agent. A Corporate Body has a recognized legal or social status
comment: Un gruppo organizzato di persone che agiscono insieme come un Agente. Un Ente ha uno status legale o sociale riconosciuto @it
label: Ente @it

CueM
type: Class
subclass of: MusicWork
comment: Sottotipo di OperaMusica, elemento costitutivo di una colonna musica, composto o adattato per una colonna sonora cinematografica, televisiva o teatrale @it
comment: Subtype of MusicWork, a constituent element of a score, composed or adapted for a film, television, or theatrical soundtrack

CueRelation
type: Class
subclass of: Relation
comment: Classe funzionale che esprime la relazione tra un'istanza di Voce di Cue Sheet, estratta da un documento bibliografico di tipo Cue Sheet, e un documento bibliografico di tipo Musica (istanza di Manifestazione). @it
comment: Functional class that expresses the relationship between an instance of a Cue Sheet Entry, extracted from a bibliographic document of Cue Sheet type, and a bibliographic document with Music (instance of Manifestation)
label: RelazioneCue @it

CueSheetEntry
type: Class
comment: Each numbered line within a document defined as a Cue Sheet corresponds to the description of the musical element that should accompany the film image at a given moment. In the context of silent films, in addition to the opening of the suggested musical piece for soundtracking, other information may appear, such as the title, placement within the film or scene, dramatic function, authors of the arrangement, publisher, duration, etc.
comment: Ogni riga numerata all'interno di un documento definito come Cue Sheet e corrispondente alla descrizione dell'elemento musicale che deve accompagnare l'immagine filmica in un dato momento. Nell'ambito del film muto oltre all'incipit del brano musicale suggerito per la sonorizzazione possono comparire altre informazioni quali il titolo, il posizionamento all'interno del film o la scena, la funzione drammatica e gli autori dell'elaborazione, l'editore, la durata, etc. @it
label: VoceDiCueSheet @it

CurrentInventory
type: Class
subclass of: Inventory
comment: Inventory numbers that are currently valid
comment: Numeri di inventario in corso di validità @it
label: InventarioAttuale @it

CurrentShelfMark
type: Class
subclass of: ShelfMark
comment: Current physical placement of the object within the conserving institution or exhibition. Usually expressed through a local code
comment: Posizionamento fisico attuale dell'oggetto all'interno dell'Istituzione conservatrice o dell'Esposizione. Solitamente espressa attraverso un codice locale @it
label: CollocazioneAttuale @it

DiscogsReleaseID
type: Class
subclass of: Identifier
comment: Codice univoco di identificazione sul DB Discogs, assegnato a ciascuna edizione specifica di una registrazione musicale. Corrisponde a una versione fisica o digitale (vinile, cassetta, download digitale...) (URL) @it
comment: Unique identification code in the Discogs database, assigned to each specific edition of a musical recording. It may corresponds to a physical or digital version (vinyl, cassette, digital download, etc.) (URL)

DOI
type: Class
subclass of: Identifier
comment: Digital Object Identifier. A unique and permanent code assigned to digital objects, such as scientific articles, books, datasets, technical reports, theses, and more
comment: Digital Object Identifier. Codice univoco e permanente assegnato a oggetti digitali, come articoli scientifici, libri, dataset, rapporti tecnici, tesi e altro @it

Damage
type: Class
comment: Lesione materiale presente in un supporto @it
comment: Material damage present in a Carrier
label: Danno @it

DamageType
type: Class
subclass of: Type
comment: Esprime attraverso un vocabolario controllato le istanze della classe di Danno @it
comment: It expresses through a controlled vocabulary the instances of the Damage class
label: TipoDiDanno @it

Date
type: Class
comment: Chronological information associated with an entity that contributes to its identification and contextualization. A date can be represented in natural language, based on a digital standard, or both
comment: Informazioni cronologiche associate a un'entità che contribuiscono alla sua identificazione e contestualizzazione. Una data può essere rappresentata in linguaggio naturale, basata su uno standard digitale, o entrambe le cose @it
label: Data @it

DemographicGroup
type: Class
subclass of: Group
comment: A group of individuals or people who share similar demographic characteristics, which may include age, gender, ethnicity, education level, occupation, marital status, income, and geographic location
comment: Insieme di individui o persone che condividono caratteristiche demografiche simili che possono includere: età, genere, etnia, livello di istruzione, occupazione, stato civile, reddito e posizione geografica @it
label: GruppoDemografico @it

Dimensions
type: Class
comment: Class that includes quantifiable properties that can be measured using calibrated measuring instruments or can be approximated
comment: Classe che comprende proprietà quantificabili che possono essere misurate attraverso strumenti di misurazione calibrati o essere approssimate @it
label: Dimensioni @it

DiscogsArtistID
type: Class
subclass of: Identifier
comment: Codice univoco di identificazione sul DB Discogs, assegnato a un* artista (autore, compositore, interprete arrangiatore o altro) (URL) @it
comment: Unique identification code in the Discogs database, assigned to an artist (author, composer, performer, arranger, or other) (URL)

DiscogsLabelID
type: Class
subclass of: Identifier
comment: Identificatore di un'etichetta discografica nel database Discogs (URL) @it
comment: Identifier of a record label in the Discogs database (URL)

DiscogsMasterID
type: Class
subclass of: Identifier
comment: Codice univoco di identificazione sul DB Discogs, assegnato a una "master release" ovvero alla versione principale di una registrazione musicale (che include tutte le edizioni, i formati e i supporti) (URL) @it
comment: Unique identification code in the Discogs database, assigned to a 'master release,' which refers to the primary version of a musical recording (including all editions, formats, and media) (URL)

DiscogsTrackID
type: Class
subclass of: Identifier
comment: Codice univoco di identificazione sul DB Discogs, assegnato a una singola traccia musicale all'interno di una Discogs release (URL) @it
comment: Unique identification code in the Discogs database, assigned to a single music track within a Discogs release (URL)

DramaticCategory
type: Class
subclass of: Type
comment: La categoria drammatica generale nella quale ricade un motivo, un cliché, un mood di un cue per l'accompagnamento di un film muto. Corrisponde nella maggior parte dei casi al titolo o a parti del titolo del cue in una raccolta di photoplay music. @it
comment: The general dramatic category in which a motif, cliché, or mood of a cue for silent film accompaniment falls. In most cases, it corresponds to the title or parts of the title of the cue in a photoplay music collection
label: CategoriaDrammatica @it

EAN
type: Class
subclass of: Identifier
comment: European Article Number. A unique identifier for generic products, with global application
comment: European Article Number. Id univoco per prodotti, di applicazione globale @it

Elaboration
type: Class
subclass of: Expression
comment: Class of Expressions resulting from the modifications of a first Expression or Representative Expression of a Work. For example, an Elaboration is a modification of the original scoring of a composition (e.g. from voices and orchestra to voices and piano, or from piano to string quartet); transcription for a different instrument; key change; etc."
comment: Classe delle Espressioni derivanti dalle modifiche di una prima Espressione o Espressione Rappresentativa di un'Opera. Per Elaborazione si intende ad esempio la modifica dell’organico originale di una composizione (p.es. da voci e orchestra a voci e pianoforte, oppure da pianoforte a quartetto), la trascrizione da uno strumento a un altro, la trasposizione di tonalità @it
label: Elaborazione @it

ElectronicCarrier
type: Class
subclass of: Carrier
comment: Carriers that require electronic or computing devices for access and reading/viewing. The content is recorded in digital/electronic format and requires equipment based on electronic circuits for reproduction
comment: Supporti che necessitano di dispositivi elettronici o informatici per l’accesso e la lettura/visualizzazione. Il contenuto è registrato in formato digitale/elettronico e richiede apparecchiature basate su circuiti elettronici per la riproduzione @it
label: SupportiElettronici @it

ElectronicResourceNumber
type: Class
subclass of: Identifier
comment: Codice identificativo univoco assegnato a una risorsa elettronica @it
comment: Unique identifier code assigned to an electronic resource
label: NumeroRisorsaElettronica @it

Ensemble
type: Class
subclass of: MediumOfPerformance
comment: Codified Ensemble (including local options) of instruments, voices, sound objects, or a mix, for musical performance
comment: Gruppo codificato (anche localmente) di strumenti, voci, oggetti sonori o misto, per l'esecuzione musicale @it
label: GruppoEnsemble @it

EthnocoreologicalAnnotation
type: Class
subclass of: Annotation
comment: Analytical information added to an existing ethnocoreological document, both in analog and digital formats
comment: Informazioni analitiche aggiunte a un documento etnocoreologico esistente sia in formato analogico, sia in formato digitale @it
label: AnnotazioneEtnocoreologica @it

EthnocoreologicalTranscription
type: Class
subclass of: Transcription
comment: Restituzione in forma scritta di una danza o una coreografia @it
comment: Written representation of a dance or choreography
label: TrascrizioneEtnocoreologica @it

EthnomusicologicalAnnotation
type: Class
subclass of: Annotation
comment: Analytical information added to an existing ethnomusicological document, both in analog and digital formats
comment: Informazioni analitiche aggiunte a un documento etnomusicologico esistente sia in formato analogico sia in formato digitale @it
label: AnnotazioneEtnomusicologica @it

EthnomusicologicalResourceType
type: Class
subclass of: Type
comment: Contains document types specific to the ethnomusicological domain and film music
comment: Contiene tipologie documentali specifiche del dominio etnomusicologico e di musica per film @it
label: TipoDiRisorsaEtnomusicologica @it

EthnomusicologicalTranscription
type: Class
subclass of: Transcription
comment: Restituzione in forma scritta di un contenuto musicale o sonoro @it
comment: Written representation of musical or sound content
label: TrascrizioneEtnomusicologica @it

Event
type: Class
comment: Questa classe comprende processi e interazioni distinti, delimitati e coerenti di natura materiale, in sistemi culturali, sociali o fisici. Esempi tipici sono incontri, nascite, morti, azioni di presa di decisione, creazione o invenzione di cose, ma anche processi più complessi ed estesi come conferenze, elezioni, costruzione di un castello o battaglie. Un Evento può essere naturale o prodotto da uno o più Agenti. Ha delimitazioni spazio-temporali @it
comment: This class includes distinct, bounded, and coherent processes and interactions of a material nature within cultural, social, or physical systems. Typical examples include meetings, births, deaths, decision-making actions, the creation or invention of things, as well as more complex and extensive processes such as conferences, elections, the construction of a castle, or battles. An Event can be natural or produced by one or more Agents. It has spatial-temporal boundaries
label: Evento @it

Exhibition
type: Class
subclass of: Event
comment: A museum exhibition is an organized unit of objects, artworks, or cultural materials presented in a museum context for educational, cultural, or informational purposes. It takes place within a dedicated physical or virtual space, which can be permanent or temporary, and aims to facilitate public access
comment: Un'esposizione museale è un'unità organizzata di oggetti, opere d'arte o materiali culturali, presentati in un contesto museale per scopi educativi, culturali o informativi. Essa si svolge all'interno di uno spazio fisico o virtuale dedicato, che può essere permanente o temporaneo, e ha come obiettivo la fruizione da parte del pubblico @it
label: Esposizione @it

Expression
type: Class
subclass of: BibliographicResource
comment: Intellectual or artistic realizations of a Work in the form of identifiable immaterial objects whose substance is symbolic. The expression is the result of an intellectual or creative process in the realization of a Work
comment: Realizzazioni intellettuali o artistiche di Opera/Work nella forma di oggetti immateriali identificabili la cui sostanza è simbolica. L'espressione è il risultato di un processo intellettuale o creativo della realizzazione di un Work @it
label: Espressione @it

Extent
type: Class
subclass of: Dimensions
comment: Insieme degli elementi che descrivono una Manifestazione o un Allegato: numero di pezzi, designazione specifica, formato ed estensione fisica @it
comment: Set of elements that describe a Manifestation or an Supplementary Material: number of pieces, specific designation, format, and physical extent
label: Estensione @it

ExternalResource
type: Class
comment: Class of external resources traceable via URL (rdfs:Resource)
comment: Classe delle risorse esterne rintracciabili tramite URL (rdfs:Resource) @it
label: RisorsaEsterna @it

Family
type: Class
subclass of: Group
comment: La classe comprende di persone legate da convenzioni sociali o culturali (ad esempio rapporti di parentela) che le uniscono come un gruppo familiare socialmente riconosciuto @it
comment: The class includes people connected by social or cultural conventions (such as family relationships) that unite them as a socially recognized family group
label: Famiglia @it

FilmAudiovisualMovingImagesWork
type: Class
subclass of: Work
comment: Film or audiovisual Works. These can include auteur films (Apocalypse Now by F.F. Coppola), documentaries (Les maîtres fous, J. Rouche), informational works (newsreels, works conceived for educational purposes), or works conceived as moving images for any medium
comment: Opera di tipo filmico o audiovisivo. Ne possono far parte film d'autore (Apocalipse Now di F.F. Coppola), documentari (Les maîtres fous, J. Rouche), opere informative (cinegiornali, opere concepite a scopo educativo) od opere concepite come immagini in movimento per qualsiasi medium @it
label: OperaFilmAudiovisiviImmaginiInMovimento @it

FilmProductionPhase
type: Class
subclass of: Event
comment: Processes and interactions of a material nature, delimited and consistent, in which the production of a film takes place
comment: Processi e interazioni di natura materiale delimitati e coerenti nei quali si realizza la produzione di un film @it
label: FaseProduttivaCinematografica @it

GeoNames
type: Class
subclass of: Identifier
comment: A class of elements equivalent to the resources available on GeoNames (URL/URI).
comment: Classe di elementi equivalenti alle risorse disponibili su GeoNames (URL/URI) @it

GovernmentPublicationNumber
type: Class
subclass of: Identifier
comment: Codice identificativo univoco assegnato alle pubblicazioni ufficiali prodotte da enti e agenzie governative @it
comment: Unique identifier code assigned to official publications produced by governmental bodies and agencies
label: NumeroPubblicazioneGovernativa @it

Group
type: Class
subclass of: Agent
comment: A set of people sharing similar characteristics of various types. The Group is a subclass of Agent. Corporate bodies and families are types of groups, though other types of groups are also possible. For example, the 'electorate'—all voters in a given election. Complex and large groups can be divided into smaller groups
comment: Un qualunque insieme di persone accomunate da caratteristiche simili di varia tipologia. Il Gruppo è una sottoclasse di Agente. Gli enti corporativi e le famiglie sono tipi di gruppi, anche se sono possibili altri tipi di gruppi. Ad esempio, l'"elettorato" — tutti gli elettori in una data elezione. I gruppi complessi e di grandi dimensioni possono essere suddivisi in altri gruppi. @it
label: Gruppo @it

HSClassification
type: Class
subclass of: Type
comment: A typological class that represents and expresses the taxonomy of musical instruments as developed in 1914 by Curt Sachs (1881-1959) and Erich von Hornbostel (1877-1935) and subsequent elaborations
comment: Classe tipologica che rappresenta ed esprime la tassonomia degli strumenti musicali così come elaborata nel 1914 da Curt Sachs (1881-1959) e Erich von Hornbostel (1877-1835) e successive elaborazioni
label: ClassificazioneHS @it

IFLAKey
type: Class
subclass of: IFLAVocabulary
comment: Harmonic and melodic principles that organize notes and musical chords hierarchically according to the tonal system, as described by the IFLA vocabulary
comment: Principi armonici e melodici che ordinano le note e gli accordi musicali in modo gerarchico secondo il sistema tonale, descritti dal vocabolario IFLA @it
label: TonalitàIFLA @it

IFLAMode
type: Class
subclass of: IFLAVocabulary
comment: Harmonic and melodic principles that organize notes and contemporary combinations of musical sounds according to a modal system, as described by the IFLA vocabulary
comment: Principi armonici e melodici che ordinano le note e le combinazioni contemporanee di suoni musicali secondo un sistema modale, descritti dal vocabolario IFLA @it
label: ModoIFLA @it

IFLAMusicalForm
type: Class
subclass of: IFLAVocabulary
comment: Term from the IFLA vocabulary used to describe the form or genre of a musical resource
comment: Termine del vocabolario IFLA utilizzato per descrivere la forma o il genere di una risorsa musicale @it
label: FormaMusicaleIFLA @it

IFLAVocabulary
type: Class
subclass of: Type
comment: Class that unites the subclasses of vocabularies and thesauri developed by IFLA (International Federation of Library Associations and Institutions)
comment: Classe che unisce le sottoclassi di vocabolari e thesauri elaborati da IFLA (International Federation of Library Associations and Institutions) @it
label: VocabolariIFLA @it

IMDb
type: Class
subclass of: Identifier
comment: Identificativo collegato all'Internet Movie Database e relativo a film, serie TV, attori, registi, produttori e altre figure dell'industria dell'intrattenimento audiovisivo (URL) @it
comment: Identifier linked to the Internet Movie Database, related to movies, TV series, actors, directors, producers, and other figures in the audiovisual entertainment industry (URL)

ISBN
type: Class
subclass of: Identifier
comment: International Standard Book Number. Codice id univoco assegnato a un libro o a una edizione di un libro (monografia) @it
comment: International Standard Book Number. Unique identifier code assigned to a book or a specific edition of a book (monograph)

ISMN
type: Class
subclass of: Identifier
comment: International Standard Music Number. Id usato per la catalogazione univoca di pubblicazioni musicali (musica scritta) @it
comment: International Standard Music Number. Identifier used for the unique cataloging of music publications (notated music)

ISNI
type: Class
subclass of: Identifier
comment: International Standard Name Identifier. It is a unique and persistent identifier for agents such as authors, creators, artists, researchers, companies, and other organizations involved in the production of intellectual, cultural, scientific, and creative content.
comment: International Standard Name Identifier. È un identificatore univoco e persistente per entità pubbliche come autori, creatori, artisti, ricercatori, aziende e altre organizzazioni coinvolte nella produzione di contenuti intellettuali, culturali, scientifici e creativi @it

ISRC
type: Class
subclass of: Identifier
comment: International Standard Recording Code. Identificatore associabile a una traccia musicale o a una registrazione audio @it
comment: International Standard Recording Code. Identifier associated with a music track or an audio recording

ISSN
type: Class
subclass of: Identifier
comment: International Standard Serial Number. Id univoco per pubblicazioni periodiche @it
comment: International Standard Serial Number. Unique identifier for periodical publications

ISSN-L
type: Class
subclass of: Identifier
comment: International Standard Serial Number - SSN variant link that is used to connect (link) all editions of the same serial publication
comment: International Standard Serial Number - Link variante di ISSN serve per collegare (link) tutte le edizioni di una stessa pubblicazione seriale @it

ISTC
type: Class
subclass of: Identifier
comment: International Standard Text Code. Codifica in modo univoco le opere letterarie e testuali senza riferirsi a un'edizione specifica. Identifica l'opera (work) @it
comment: International Standard Text Code. Uniquely encodes literary and textual works without referring to a specific edition. It identifies the work

Identifier
type: Class
subclass of: Appellation
comment: A string associated with a resource that is capable of uniquely identifying it within a specific domain
comment: Stringa associata a una risorsa e in grado di identificarla univocamente all'interno di uno specifico dominio @it
label: Identificativo @it

ImagePhotographyWork
type: Class
subclass of: Work
comment: Opera di tipo fotografia, grafica o altra realizzazione artistica visuale fissa @it
comment: Work of photography, graphic design, or other fixed visual artistic creation
label: OperaImmagineFotografia @it

Inscription
type: Class
comment: Class that describes the possible inscriptions found on the instrument made by an agent, indicating their position, the form in which they appear, and the diplomatic transcription
comment: Classe che descrive le eventuali iscrizioni rintracciabili sullo strumento realizzate a opera di un agente, indicandone la posizione, la forma nella quale si presentano e la trascrizione diplomatica @it
label: Iscrizione @it

Inventory
type: Class
subclass of: Identifier
comment: Alphanumeric string that acts like an unique identification of the object stored within the conservative institution
comment: Stringa alfanumerica di identificazione univoca dell'oggetto conservato all'interno dell'Istituzione/Luogo di conservazione @it
label: Inventario @it

Item
type: Class
subclass of: BibliographicResource
comment: Oggetti fisici che esemplificano/reificano una Manifestazione @it
comment: Physical objects that exemplify/reify a Manifestation
label: Esemplare @it

Language
type: Class
subclass of: LanguageGroup
comment: Lingue e linguaggi naturali e artificiali tra cui lingue moderne, antiche, estinte elencate e classificate secondo lo standard ISO 639-3 @it
comment: Natural and artificial languages, including modern, ancient, and extinct languages, listed and classified according to the ISO 639-3 standard
label: Lingua @it

LanguageGroup
type: Class
subclass of: Type
comment: Class of living or extinct language families and groups listed and classified according to the ISO 639-5 standard
comment: Le diverse famiglie e gruppi di lingue viventi o estinte elencati e classificati secondo lo standard ISO 639-5 @it
label: GruppoLinguistico @it

GeographicAreasLoC
type: Class
subclass of: Identifier
comment: Codes used by the Library of Congress (Library of Congress Geographic Areas) to identify geographical locations, including countries, primary political divisions of some countries, regions, geographical features, outer space, and celestial bodies
comment: Codici utilizzati dalla Library of Congress (Library of Congress Geographic Areas) per identificare luoghi geografici, incluse nazioni, divisioni politiche primarie di alcuni paesi, regioni, caratteristiche geografiche, lo spazio esterno e corpi celesti @it
label: AreeGeograficheLoC @it

ThesaurusGraphicMaterialsLoC
type: Class
subclass of: Type
comment: A controlled vocabulary developed by the Library of Congress to describe, catalog, and organize graphic materials such as photographs, prints, drawings, posters, and other forms of visual images
comment: Vocabolario controllato sviluppato dalla Library of Congress per descrivere, catalogare e organizzare materiali grafici, come fotografie, stampe, disegni, manifesti e altre forme di immagini visive @it
label: ThesaurusMaterialiGraficiLoC @it

LoCMediumOfPerformance
type: Class
subclass of: Type
comment: Thesauro dei medium della performance musicale @it
comment: Thesaurus of musical performance media
label: MediumDellaPerformanceLoC @it

LoCSubjectHeadings
type: Class
subclass of: Type
comment: Subject Headings developed by the Library of Congress that refer to bibliographic subjects
comment: Termini di soggetto elaborati dalla Library of Congress e che si riferiscono a soggetti bibliografici. @it
label: SoggettarioLoC @it

LocalName
type: Class
subclass of: Name
comment: Nome specifico utilizzato in specifici contesti geo-culturali per riferirsi a entità del reale (strumenti musicali, performer, occasioni, eventi o ruoli rituali, processi, pratiche, attività, etc.) @it
comment: Specific name used in specific geo-cultural contexts to refer to real entities (musical instruments, performers, occasions, events or ritual roles, processes, practices, activities, etc.)
label: DenominazioneLocale @it

MIMOKeyword
type: Class
subclass of: Type
comment: Termini elaborati dal progetto MIMO (Musical Instrument Museum Online) utilizzati come soggettario per la navigazione nel portale e utili per una migliore interoperabilità. In particolare ci si riferisce a definizioni tipologiche e/o denominazioni locali di strumenti @it
comment: Terms developed by the MIMO project (Musical Instrument Museum Online) used as a subject heading for navigation in the portal and useful for better interoperability. Specifically, it refers to typological definitions and/or local denominations of instruments
label: KeywordMIMO @it

Manifestation
type: Class
subclass of: BibliographicResource
comment: Class containing products that can represent one or more Expressions, having implemented an adequate cardinality (0,n) for the properties linking to other WEMI classes (acu:ManifestationOf > Work, acu:hasExpression > Expression, acu:hasItem > Item). A Manifestation is defined by both the general content and the form of presentation. The substance of the manifestation is not only the sign, as in the expression, but also includes the type of medium adopted. Therefore, this class includes all bibliographic resources that fall within the WEMI conceptualization, as well as so-called 'preparatory materials,' which are resources that traditionally would be found in an intermediate (intersection) class between bibliographic resources (thus describable and locatable within editorial processes) and archival resources (which require less granular descriptions and are not linked to abstract objects that function as aggregators like the Work or the Expression, and typically are intermediate materials accumulated during productive and creative processes that do not achieve functional autonomy)
comment: Classe che contiene prodotti che possono rappresentare una o più Espressioni avendo implementato una cardinalità adeguata (0,n) per le proprietà che collegano alle altre classi WEMI (acu:ManifestazionDi > OperaWork, acu:haEspressione > Espressione, acu:haEsemplare > Esemplare). Una Manifestazione è definita sia dal contenuto generale sia dalla forma della presentazione. La sostanza della manifestazione non è solamente il segno, come nell'espressione, ma include anche il tipo di medium adottato. Sono quindi incluse in questa classe tutte le risorse bibliografiche che rientrano nella concettualizzazione WEMI, ma anche i cosiddetti "materiali preparatori", ovvero risorse che tradizionalmente si troverebbero in una classe intermedia (intersezione) tra le risorse bibliografiche (quindi come tali descrivibili e collocabili all'interno di processi editoriali) e le risorse archivistiche (che necessitano di descrizioni meno granulari e non sono collegate a oggetti astratti che fungono da aggregatori come l'Opera o l'Espressione e solitamente sono materiali intermedi accumulati durante processi produttivi e creativi che non raggiungono una propria autonomia funzionale) @it
label: Manifestazione @it

MasterNumber
type: Class
subclass of: Identifier
comment: Codice univoco assegnato alla matrice di stampa o di masterizzazione di una risorsa musicale (copia master) @it
comment: Unique code assigned to the printing or mastering master of a musical resource
label: NumeroMatrice @it

Material
type: Class
comment: Sostanze o aggregati di sostanze, con specifiche caratteristiche fisiche e chimiche, delle quali sono costituiti gli Strumenti musicali o i Supporti delle risorse bibliografiche o degli Allegati @it
comment: Substances or aggregates of substances, with specific physical and chemical characteristics, of which musical instruments or the supports of bibliographic resources or attachments are made
label: Materiale @it

Measurement
type: Class
subclass of: Dimensions
comment: Comprende misure specifiche di parti non separabili di una risorsa di tipo Strumento Musicale. Ad esempio: la distanza tra i fori di un flauto, lo spessore della copertina di una Cinquecentina, la lunghezza vibrante della corda @it
comment: Includes specific measurements of inseparable parts of a resource of the type Musical Instrument. For example: the distance between the holes of a flute, the thickness of the cover of a Cinquecentina, the vibrating length of a string
label: MisurazioneAnalitica @it

MechanicalOrAutomaticMusicalInstrumentsCarrier
type: Class
subclass of: Carrier
comment: Carriers that require a physical or electromechanical mechanism for reading or reproducing the musical content
comment: Supporti che richiedono un meccanismo fisico o elettromeccanico per la lettura o la riproduzione del contenuto musicale @it
label: SupportiPerStrumentiMusicaliMeccaniciOAutomatici @it

Media
type: Class
comment: File media collegati alle risorse in diverso formato (es, PDF, MIDI, MP4...) @it
comment: Media files linked to resources in various formats (e.g., PDF, MIDI, MP4...)

MediaAlphabeticAndVisualCarrier
type: Class
subclass of: Carrier
comment: Carrier whose use occurs through the reading of alphabetic text (alphabetic mediation) and the observation of graphic/symbolic/visual elements (visual mediation). They typically include textual publications, comic or illustrated publications, and any material in which comprehension occurs primarily through textual and/or iconographic means, without the need for a decoding and reproduction device
comment: Supporti la cui fruizione avviene attraverso la lettura di testo alfabetico (mediazione alfabetica) e l’osservazione di elementi grafici/simbolici/visuali (mediazione visiva). Comprendono tipicamente le pubblicazioni testuali, le pubblicazioni a fumetti o illustrate e qualsiasi materiale in cui la comprensione avviene principalmente per via testuale e/o iconografica, senza il bisogno di un apparecchio di decodifica e riproduzione @it
label: SupportiAMediazioneAlfabeticaEVisuale @it

MediaType
type: Class
subclass of: Type
comment: Descriptors for the Media class
comment: Descrittori per la classe Media @it
label: TipoDiMedia @it

MediumOfPerformance
type: Class
comment: Medium of instrumental, vocal, and/or other performance through which a musical resource has been created, written, or performed
comment: Mezzo di esecuzione strumentale, vocale e/o altro per il quale una risorsa musicale è stata creata, scritta o eseguita @it
label: MezzoDiEsecuzione @it

MicroformCarrier
type: Class
subclass of: Carrier
comment: Carriers that contain reduced-format reproductions of texts or images, readable only through special readers that allow magnification. They are used for preservation purposes or to reduce physical bulk
comment: Supporti che contengono riproduzioni in formato ridotto di testi o immagini, leggibili solo attraverso appositi lettori che ne consentono l’ingrandimento. Sono utilizzati per motivi di conservazione o per ridurre l’ingombro fisico @it
label: SupportiInMicroforma @it

MusicIncipit
type: Class
subclass of: Identifier
comment: Identificatore standard per i manoscritti musicali e per qualsiasi risorsa musicale notata. L'incipit musicale consiste nella trascrizione di note e altri elementi come tonalità, metro, indicazione di movimento etc., secondo i criteri definiti da UNIMARC e dalla normativa bibliografica internazionale @it
comment: Standard identifier for musical manuscripts and any notated musical resource. The musical incipit consists of the transcription of notes and other elements such as key, meter, tempo markings, etc., according to the criteria defined by UNIMARC and international bibliographic standards
label: IncipitMusicale @it

MusicOrSoundPhenomenon
type: Class
subclass of: Event
comment: A class that includes all sound and/or musical phenomena experienced and interpreted by human agents. These phenomena can encompass sounds organized or produced by humans (anthropophony), by non-human agents (biophony), or by natural phenomena that generate auditory perceptions (geophony). These phenomena can be described using concepts such as scale, rhythm, melodic structure, or other formal parameters that allow for their analytical description (etic and/or emic)
comment: Una classe che comprende tutti i fenomeni sonori e/o musicali esperiti e interpretati da agenti umani. Questi fenomeni possono ricomprendere suoni umanamente organizzati o prodotti da esseri umani (antropofonia), da agenti non umani (biofonia) o da fenomeni naturali che generano percetti sonori (geofonia). Questi fenomeni possono essere descritti utilizzando concetti quali scala, ritmo, struttura melodica o altri parametri formali che ne consentono la descrizione analitica (etica e/o emica) @it
label: FenomenoMusicaleOSonoro @it

MusicProductionPhase
type: Class
subclass of: Event
comment: Processes and interactions of a material nature, described as delimited and consistent, in which the production of a film's soundtrack takes place
comment: Processi e interazioni di natura materiale delimitati e coerenti nei quali si realizza la produzione della colonna sonora di un film @it
label: FaseProduttivaMusicale @it

MusicWork
type: Class
subclass of: Work
comment: Musical Work
comment: Opera di tipo musicale @it
label: OperaMusica @it

MusicalElaborationType
type: Class
subclass of: Type
comment: Class containing the types of musical elaboration that modify the first Expression, or the representative Expression of the Work (but not the Work itself). For example, 'adaptation', 'arrangement', 'reduction', 'contrafactum', etc.
comment: Classe contenente le tipologie di elaborazione musicale che modificano la prima Espressione, o l'Espressione rappresentativa dell'Opera (ma non l'Opera stessa). Ad esempio "adattamento", "arrangiamento", "riduzione", "contrafactum", etc. @it
label: TipoDiElaborazioneMusicale @it

MusicalGenre
type: Class
subclass of: Type
comment: Musical genre dependent on the cultural context that produces it and the conceptualization made both by the reference culture and by the ethnological-anthropological generalization potentially generated by the scholar
comment: Tipologia musicale dipendente dal contesto culturale che la produce e dalla concettualizzazione che ne viene fatta sia dalla cultura di riferimento sia dalla generalizzazione etno-antropologica eventualmente generata dallo studioso @it
label: GenereMusicale @it

MusicalInstrumentClass
type: Class
subclass of: Type
comment: Class (closed vocabulary) representing the first level of the Hornbostel Sachs taxonomy: Idiophones, Membranophones, Chordophones, Aerophones. These terms are supplemented by Electrophones and Multi-organic instruments, where the vibrating mechanism is multiple
comment: Classe (vocabolario chiuso) che rappresenta il primo livello della tassonomia Hornbostel Sachs: Idiofoni, Membranofoni, Cordofoni, Aerofoni. A questi termini si aggiungono gli Elettrofoni e Multiorganici, strumenti nei quali il meccanismo vibrante è multiplo. @it
label: FamigliaStrumentiMusicali @it

MusicalInstrumentOrSoundObject
type: Class
subclass of: MediumOfPerformance
comment: Musical instruments or sound objects (including non-specific ones = generalizations). A device or mechanism used to produce sounds that each specific culture, subculture, or demographic group considers suitable for musical use
comment: Strumenti musicali o oggetti sonori (anche non specifici = generalizzazioni). Dispositivo o congegno usato per produrre suoni che ogni specifica cultura, subcultura o gruppo demografico considera idonei all'uso musicale @it
label: StrumentoMusicaleOOggettoSonoro @it

MusicalInstrumentResource
type: Class
subclass of: AcustemeResource
comment: Museum resources belonging to the category of musical instruments or sound objects. Musical instruments are objects designed and built to produce humanly organized sounds. Sound objects are objects, tools, and instruments of all kinds capable of producing sounds, but not always specifically designed for sound production and musical performance
comment: Risorse museali appartenenti alla tipologia strumento musicale o oggetto sonoro. Con strumenti musicali si intendono gli oggetti ideati e costruiti per produrre suoni umanamente organizzati. Con oggetti sonori si intendono oggetti, utensili e strumenti di ogni tipo in grado di produrre suoni, ma non sempre specificatamente ideati per la produzione sonora e la performance musicale @it
label: RisorsaStrumentoMusicale @it

Name
type: Class
subclass of: Appellation
comment: A label, title, or term that designates an entity in order to distinguish it from other similar entities
comment: Un'etichetta, un titolo o un termine che designa un'entità al fine di renderla distinguibile da altre entità simili @it
label: Nome @it

NameAuthoritiesLoC
type: Class
subclass of: Identifier
comment: Identificatore di una voce d'autorità della Library of Congress (URL) @it
comment: Identifier of a Library of Congress authority record (URL)
label: AutoritàDeiNomiLoC @it

Nationality
type: Class
subclass of: Type
comment: Appartenenza di un agente (in particolare di un Gruppo Demografico) a un determinato stato. Usato come sinonimo di cittadinanza ufficiale @it
comment: Origin of an agent (particularly of a Demographic Group) to a certain state. Used as a synonym for official citizenship
label: Nazionalità @it

Person
type: Class
subclass of: Agent
comment: La classe rappresenta individui, reali o immaginari, ed è una sottoclasse della classe Agente @it
comment: The class represents real or imaginary individuals and is a subclass of the Agent class
label: Persona @it

Place
type: Class
comment: Questa classe comprende estensioni nello spazio fisico, in particolare sulla superficie della Terra, indipendenti dai fenomeni temporali e dalla materia.Queste estensioni possono essere utilizzate per descrivere la posizione fisica delle cose o dei fenomeni, o altre aree di interesse @it
comment: This class includes extensions in physical space, particularly on the Earth's surface, independent from temporal phenomena and matter. These extensions can be used to describe the physical location of things or phenomena, or other areas of interest
label: Luogo @it

PlateNumber
type: Class
subclass of: Identifier
comment: Il numero di lastra è il numero d’inventario degli editori musicali stampato anche a piè di pagina e generalmente su tutte le pagine. Identifica, unito al nome dell’editore, le risorse nate dalla stessa matrice. Il numero di lastra può essere formato da una combinazione di numeri, lettere, simboli, può comprendere il nome dell’editore e/o le sue iniziali e può essere di editore diverso da quello indicato sul frontespizio @it
comment: The plate number is the inventory number of music publishers, typically printed at the bottom of the page and generally on every page. It identifies, together with the publisher's name, the resources derived from the same matrix. The plate number can consist of a combination of numbers, letters, and symbols, may include the publisher's name and/or initials, and may belong to a publisher different from the one indicated on the title page
label: NumeroLastra @it

PreviousInventory
type: Class
subclass of: Inventory
comment: Inventory numbers that are no longer valid
comment: Numeri di inventario non più in corso di validità @it
label: InventarioPrecedente @it

PreviousShelfMark
type: Class
subclass of: ShelfMark
comment: Posizionamento fisico precedente dell'oggetto all'interno di una Istituzione conservatrice o di una Esposizione. Solitamente espressa attraverso un codice locale @it
comment: Previous physical placement of the object within a conserving institution or exhibition. Usually expressed through a local code
label: CollocazionePrecedente @it

Process
type: Class
subclass of: Event
comment: A series of activities that characterize a creative and/or productive phase
comment: Serie di attività che caratterizzano una fase creativa e/o produttiva @it
label: Processo @it

ProjectableMovingImagesCarrier
type: Class
subclass of: Carrier
comment: Carriers that contain sequences of images which, when projected, create the illusion of movement. They require a projector (analog or digital) and are primarily in film format or magnetic/electronic/digital derivatives on physical media
comment: Supporti che contengono sequenze di immagini che, se proiettate, creano l’illusione del movimento. Richiedono un proiettore (analogico o digitale) e sono principalmente in formato pellicola o derivati magnetici/elettronici/digitali su supporti fisici @it
label: SupportiDiImmaginiProiettateInMovimento @it

ProjectableStaticImagesCarrier
type: Class
subclass of: Carrier
comment: Carriers that display fixed (static) images projected onto a screen or other surface using a projector or similar device. They do not involve the movement of images; they are therefore single slides or sequences of still images
comment: Supporti che presentano immagini fisse (statiche) proiettate su uno schermo o altra superficie mediante l’uso di un proiettore o apparecchio simile. Non prevedono il movimento delle immagini; si tratta quindi di singole diapositive o sequenze di immagini ferme @it
label: SupportiDiImmaginiProiettateStatiche @it

Protection
type: Class
comment: Class that describes the methods, measures, and competent Corporate Bodies for the protection of a museum asset, particularly for Musical Instrument Resources
comment: Classe che descrive le modalità, i provvedimenti, gli enti competenti per la tutela di un bene museale e in particolare delle Risorse Strumento Musicale @it
label: Tutela @it

PublishingNumber
type: Class
subclass of: Identifier
comment: Codice identificativo univoco assegnato a una specifica uscita o numero di una specifica pubblicazione @it
comment: Unique identifier code assigned to a specific issue or number of a specific publication
label: NumeroEditoriale @it

RFID
type: Class
subclass of: Identifier
comment: Radio Frequency Identification. A technological identifier (radio waves) that enables the unique identification of objects
comment: Radio Frequency Identification. Identificativo tecnologico (onde radio) che permette il riconoscimento univoco di oggetti @it

RISM
type: Class
subclass of: Identifier
comment: Répertoire International des Sources Musicales. A catalog for the documentation of information on resources related to notated music (scores, sheet music, manuscripts, librettos, etc.)
comment: Répertoire International des Sources Musicales. Repertorio per la catalogazione delle informazioni su risorse relative alla musica scritta (partiture, spartiti, manoscritti, libretti...) @it

Record
type: Class
subclass of: ArchivalResource
comment: Risorse singole o “singoletti”presenti con almeno un’istanza su qualunque supporto e in qualunque formato “leggibile” da un Agente (umano o meccanico). @it
comment: Single resources or 'singletons' (singoletti) present with at least one instance on any medium and in any format 'readable' by an Agent (human or mechanical)
label: Risorsa @it

RecordPart
type: Class
subclass of: ArchivalResource
comment: An element that is part of an Archival Resource and without which the Resource would not be complete, but physically separated
comment: Elemento facente parte di una Risorsa archivistica e senza il quale la Risorsa non sarebbe completa, ma fisicamente separato. @it
label: ParteDiRisorsa @it

RecordSet
type: Class
subclass of: ArchivalResource
comment: Archives, collections, assemblages, and artificial sets (also in digital format) of Archival Resources or of resources classified as such
comment: Fondi, collezioni, raccolte e insiemi fattizi (anche in formato digitale) di Risorse di tipo archivistico o che vengano catalogate come tali @it
label: InsiemeDiRisorse @it

Relation
type: Class
comment: Classe toplevel di Relazione. Connette almeno due owl:Thing @it
comment: Top-level class of Relation. Connects at least two owl:Thing
label: Relazione

RelationCueNotatedMusic
type: Class
subclass of: CueRelation
comment: Classe funzionale che esprime la relazione tra un'istanza di Voce di Cue Sheet e un documento di Musica scritta che ne rappresenta il contenuto. La relazione descrive il punto di inizio e di fine del taglio musicale estratto dal brano selezionato, indicando il numero delle battute iniziale e finale @it
comment: Functional class that expresses the relationship between a Cue Sheet Entry instance and a notated music document that represents its content. The relationship describes the start and end points of the musical excerpt extracted from the selected piece, indicating the initial and final bar numbers
label: RelazioneCueMusicaScritta @it

RelationCueRecording
type: Class
subclass of: CueRelation
comment: Classe funzionale che esprime la relazione tra un'istanza di Voce di Cue Sheet e un'Audioregistrazione che ne rappresenta il contenuto. La relazione descrive il punto di inizio e di fine del taglio musicale estratto dal brano selezionato, indicando il minutaggio @it
comment: Functional class that expresses the relationship between a Cue Sheet Entry instance and an Audio Recording that represents its content. The relationship describes the start and end points of the musical excerpt extracted from the selected track, indicating the timing
label: RelazioneCueRegistrazione @it

RepresentationOrRecording
type: Class
subclass of: Expression
comment: Class related to the Representations (stage) and recordings (Live/studio) of the specific Expression of a Work for which the Manifestation is being cataloged
comment: Classe relativa alle Rappresentazioni (scenica) e alle registrazioni (Live/studio) della specifica Espressione di un'Opera di cui si sta catalogando la Manifestazione @it
label: RappresentazioneORegistrazione @it

ResearchCampaign
type: Class
subclass of: Event
comment: Event in which a continuous research activity, primarily of an ethnographic nature, has been carried out by one or more Agents
comment: Evento nel quale è stata portata avanti un'attività continuativa di ricerca prevalentemente di tipo etnografico da uno o più Agenti @it
label: CampagnaDiRicerca @it

RitualEventOrOccasion
type: Class
subclass of: Event
comment: Activity or a series of activities and/or actions that can be formalized, symbolic, iterative, and may take place within a cultural, religious, social, or traditional context, to express values, beliefs, or identities shared by a community. It can be identified with specific generic definitions and terms or through Local Name
comment: Attività o una serie di attività e/o azioni che possono essere formalizzate, simboliche, iterative e possono svolgersi all'interno di un contesto culturale, religioso, sociale o tradizionale, per esprimere valori, credenze o identità condivise da una comunità. Può essere individuato con definizioni e Appellativi specifici generici o tramite denominazioni locali @it
label: EventoRitualeOOccasione @it

Role
type: Class
comment: L'insieme delle mansioni di un Agente rispetto a un processo o a un sistema organizzato @it
comment: The set of tasks of an Agent connected to a process or an organized system
label: Ruolo @it

SBNIta
type: Class
subclass of: Identifier
comment: National Bibliographic Service. ID assigned by the SBN system to each document received and cataloged by participating libraries (including authors)
comment: Servizio Bibliografico Nazionale. Id assegnato dal circuito SBN a ogni documento ricevuto e catalogato dalle biblioteche aderenti (compresi gli autori) @it

Sartori
type: Class
subclass of: Identifier
comment: Bibliographic catalog of Italian music librettos printed from the origins of opera to 1800s
comment: Repertorio bibliografico dei libretti per musica italiani a stampa dalle origini al 1800 @it

Scoring
type: Class
comment: Codified or non-codified medium of performance; a set of sound objects or instruments used for the creation of the musical type of Work
comment: Mezzo di esecuzione codificato o non codificato; insieme di oggetti sonori o strumenti che servono per la realizzazione dell'Opera/Musica @it
label: Organico @it

Segmentation
type: Class
comment: Class of individuals derived from the segmentation of an audio, video, or audiovisual file
comment: Classe degli individui derivati dalla segmentazione di un file audio o video o audiovideo @it
label: Segmentazione @it

ShelfMark
type: Class
comment: Posizionamento fisico precedente dell'oggetto all'interno di una Istituzione conservatrice o di una Esposizione. Solitamente espressa attraverso un codice locale @it
comment: Previous physical placement of the object within a conserving institution or exhibition. Usually expressed through a local code
label: Collocazione @it

SortingTitle
type: Class
subclass of: Title
comment: Also known as Uniform Title. Title used for the alphabetical arrangement of Works according to REICAT (Italian Rules for Bibliographic Cataloging)
comment: Anche detto Titolo uniforme. Titolo usato per l'ordinamento alfabetico delle Opere/Work secondo REICAT (Regole Italiane di Catalogazione Bibliografica) @it
label: TitoloDiOrdinamento @it

SoundRecordingEditionNumber
type: Class
subclass of: Identifier
comment: Codice univoco di identificazione assegnato a una specifica edizione di una registrazione musicale @it
comment: Unique identifier code assigned to a specific edition of a music recording
label: NumeroEdizioneRegistrazioniSonore @it

SpecialInventory
type: Class
subclass of: Inventory
comment: Alternative inventory numbers that are currently valid
comment: Numeri di inventario alternativi in corso di validità @it
label: InventarioSpeciale @it

SupplementaryMaterial
type: Class
comment: Any material - of lesser importance or substance, complementary or subordinate in nature - issued, produced, or published concurrently with the described Manifestation and intended to be used and preserved together with it
comment: Qualsiasi materiale - di minore consistenza o importanza, o comunque di carattere complementare o subordinato - emesso, prodotto o pubblicato contemporaneamente alla Manifestazione descritta e destinato a essere usato e conservato insieme a essa. @it
label: Allegato @it

TextualAnnotation
type: Class
subclass of: Annotation
comment: Analytical information added to an existing textual document, both in analog and digital formats
comment: Informazioni analitiche aggiunte a un documento testuale esistente sia in formato analogico, sia in formato digitale @it
label: AnnotazioneTesto @it

TextualTranscription
type: Class
subclass of: Transcription
comment: Restituzione in forma scritta di un contenuto verbale @it
comment: Written representation of verbal content
label: TrascrizioneTestuale @it

TextualWork
type: Class
subclass of: Work
comment: Opera di tipo testuale (narrativa, saggistica, libretti d'opera...) @it
comment: Work of a textual type (narrative, essays, opera librettos...)
label: OperaTesto @it

ThreeDimensionalObjectsWork
type: Class
subclass of: Work
comment: Opera destinata a essere percepita visivamente in tre dimensioni, compresi oggetti creati dall'uomo come modelli, sculture, abiti e giocattoli, nonché oggetti presenti in natura come esemplari montati per la visione. @it
comment: Work intended to be perceived visually in three dimensions, including man-made objects such as models, sculptures, clothing, and toys, as well as naturally occurring objects such as specimens mounted for viewing
label: OperaOggettiTridimensionali @it

Title
type: Class
subclass of: Name
comment: Name or phrase that identifies a bibliographic resource
comment: Nome o frase che identifica una risorsa bibliografica @it
label: Titolo @it

TitleNatureOrSubtype
type: Class
subclass of: Type
comment: Esprime la tipologia di titolo al quale ci si riferisce, per differenziarlo da altri eventuali titoli della Risorsa @it
comment: It expresses the type of title being referred to, in order to differentiate it from other possible titles of the Resource
label: NaturaDelTitoloESottotipo @it

Transcription
type: Class
subclass of: EthnomusicologicalResourceType
comment: Restituzione in forma scritta di un contenuto @it
comment: Written representation of content
label: Trascrizione @it

Translation
type: Class
subclass of: Expression
comment: Class of Expressions derived from the translation of the Representative Expression in the original language
comment: Classe delle Espressioni derivanti dalla traduzione dell'Espressione Rappresentativa in lingua originale @it
label: Traduzione @it

Type
type: Class
comment: A conceptual class that describes the possibility for other classes to have different types within them, using terms from thesauri or controlled vocabularies
comment: Classe concettuale che descrive la possibilità di altre classi di avere tipologie diverse al loro interno, utilizzando termini di thesauri o vocabolari controllati @it
label: Tipo @it

TypologicalDefinition
type: Class
subclass of: Type
comment: A controlled vocabulary of terms or expressions referring to musical instruments, identifying some key points of the HS classification
comment: Vocabolario controllato di termini o espressioni che si riferiscono a strumenti musicali identificando alcuni snodi della classificazione HS @it
label: DefinizioneTipologica @it

UNESCOIntangibleCulturalHeritageLists
type: Class
subclass of: Type
comment: Insieme di elenchi (vocabolari controllati) creati per identificare, proteggere e promuovere le tradizioni, le espressioni culturali e le pratiche che costituiscono il patrimonio immateriale delle comunità in tutto il mondo @it
comment: Set of lists (controlled vocabularies) created to identify, protect, and promote the traditions, cultural expressions, and practices that constitute the intangible heritage of communities worldwide

UNESCOThesaurus
type: Class
subclass of: Type
comment: Controlled and structured vocabulary developed by UNESCO (United Nations Educational, Scientific and Cultural Organization) to organize and index information related to its areas of expertise
comment: Vocabolario controllato e strutturato sviluppato dall'UNESCO (Organizzazione delle Nazioni Unite per l'Educazione, la Scienza e la Cultura) per organizzare e indicizzare informazioni relative ai suoi ambiti di competenza @it

UPC
type: Class
subclass of: Identifier
comment: Universal Publication Code. ID used for cataloging periodical publications. It also refers to the numeric code or barcode assigned to commercial products to uniquely identify them
comment: Universal Publication Code. Id usato per la catalogazione delle pubblicazioni periodiche. Si riferisce anche al codice numerico o codice a barre assegnato a prodotti commerciali per identificarli univocamente @it

UnencodedIdentifier
type: Class
subclass of: Identifier
comment: Identificatore non codificato @it
comment: Unencoded Identifier
label: IdentificatoreNonCodificato @it

UseRelation
type: Class
subclass of: Relation
comment: Classe funzionale che esprime la relazione tra un'istanza di Manifestazione o Risorsa Archivistica e un'altra istanza di Manifestazione o Risorsa Archivistica. In particolare si intendono gli usi musicali come elaborazioni, arrangiamenti, riduzioni, contrafacta, etc. per i quali una Risorsa è Sorgente di informazioni (ad esempio con l'uso di elementi motivici, sequenze accordali, parti fisiche di nastro...) per una risorsa Destinazione che è il risultato creativo dell'uso di tale materiale. La relazione implica la specificazione delle sezioni della Sorgente usate nella Destinazione in termini di battute o di minutaggio (a seconda del tipo di Sorgente) @it
comment: Functional class that expresses the relationship between an instance of Manifestation or Archival Resource and another instance of Manifestation or Archival Resource. Specifically, it refers to musical uses such as elaborations, arrangements, reductions, contrafacta, etc., for which a Resource serves as the Source of information (e.g., through the use of motivic elements, chord sequences, physical tape parts...) for a Destination resource, which is the creative result of using such material. The relationship implies the specification of the sections of the Source used in the Destination in terms of measures or timing (depending on the type of Source)
label: RelazioneUso @it

VIAF
type: Class
subclass of: Identifier
comment: Virtual International Authority File. Identificatore che unifica i dati bibliografici sulle autorità (autori, titoli e altri elementi) (URL) @it
comment: Virtual International Authority File. Identifier that consolidates bibliographic data on authorities (authors, titles, and other elements) (URL)

VariantTitle
type: Class
subclass of: Title
comment: Title associated with the bibliographic resource that differs from the main title
comment: Titolo associato alla risorsa bibliografica che differisce dal titolo principale @it
label: VarianteDelTitolo @it

VideoAnnotation
type: Class
subclass of: Annotation
comment: Analytical information added to an existing video or audiovisual document, both in analog and digital formats
comment: Informazioni analitiche aggiunte a un documento video o audiovideo esistente sia in formato analogico, sia in formato digitale @it
label: AnnotazioneVideo @it

VideoCarrier
type: Class
subclass of: Carrier
comment: Carriers that contain video recordings — either analog or digital — reproducible through specific video equipment (such as video recorders, DVD players, Blu-ray players). Unlike film reels, video media are typically designed to be used with devices like TVs, monitors, or electronic video projectors
comment: Supporti che contengono registrazioni video — analogiche o digitali — riproducibili tramite apparecchiature video specifiche (ad esempio videoregistratori, lettori DVD, lettori Blu-ray). A differenza delle pellicole cinematografiche, i supporti video sono solitamente progettati per l’uso con dispositivi come TV, monitor o proiettori video elettronici @it
label: SupportiVideo @it

VideoMedia
type: Class
subclass of: Media
comment: File media di tipo video collegati alle risorse e in diverso formato (es, MP4, AVI, MOV...) @it
comment: Video media files linked to resources in various formats (e.g., MP4, AVI, MOV...)
label: MediaVideo @it

VideoRecordingNumber
type: Class
subclass of: Identifier
comment: Codice identificativo univoco per videoregistrazioni o registrazioni audiovisive @it
comment: Unique identifier code for video recordings or audiovisual recordings
label: NumeroVideoregistrazione @it

Voice
type: Class
subclass of: MediumOfPerformance
comment: Capacità fonatoria umana. Questa classe è relativa ai possibili usi musicali della voce umana intesi come registri o modalità di emissione culturalmente elaborate, individuate, classivicate, descritte, definite, nominate anche con gerghi locali e/o termini emici @it
comment: Human vocal ability. This class relates to the possible musical uses of the human voice, understood as culturally elaborated registers or modes of emission, identified, classified, described, defined, and named, including with local jargon and/or emic terms
label: Voce @it

Wikidata
type: Class
subclass of: Identifier
comment: Class of elements equivalent to the resources available on Wikidata (URL/URI)
comment: Classe di elementi equivalenti alle risorse disponibili su Wikidata (URL/URI) @it

Wikipedia
type: Class
subclass of: Identifier
comment: Class of Wikipedia entries related to the resources available on Wikipedia (URL)
comment: Classe di voci Wikipedia relative alle risorse disponibili su Wikipedia (URL) @it

Work
type: Class
subclass of: BibliographicResource
comment: Distinct ideas conveyed through artistic and intellectual creations. They are the result of an intellectual process by one or more Agents and are characterized by realizations recognizable as one or more Expressions
comment: Idee distinte veicolate da creazioni artistiche e intellettuali. Sono il risultato di un processo intellettuale di uno o più Agenti e sono caratterizzate da realizzazioni riconoscibili come una o più Espressioni @it
label: Opera @it

WorldCat
type: Class
subclass of: Identifier
comment: Identificatore relativo al catalogo bibliografico WorldCat (URL) @it
comment: Identifier related to the WorldCat bibliographic catalog (URL)

3DModel
type: Class
subclass of: Media
comment: File media di tipo immagine collegati alle risorse e in diverso formato (es, OBJ, PLY, NXS...) @it
comment: Image media files linked to resources in various formats (e.g., OBJ, PLY, NXS...)
label: Modello3D @it

Arrangement
type: NamedIndividual
type: MusicalElaborationType
label: Arrangiamento @it

Bad
type: NamedIndividual
type: ConservationStatusType
label: Cattivo @it

CueSheetsSilentFilm
type: NamedIndividual
type: EthnomusicologicalResourceType
label: CueSheetSilentFilm @it

Decent
type: NamedIndividual
type: ConservationStatusType
label: Decente @it

ElectronicElaboration
type: NamedIndividual
type: MusicalElaborationType
label: ElaborazioneElettronica @it

Excellent
type: NamedIndividual
type: ConservationStatus
label: Ottimo

Good
type: NamedIndividual
type: ConservationStatusType
label: Buono @it

Mediocre
type: NamedIndividual
type: ConservationStatusType

MembraneReed
type: NamedIndividual
type: TypologicalDefinition
label: AnciaAMembrana @it

SimplifiedTranscriptionRID
type: NamedIndividual
type: TextualTranscription
label: TrascrizioneSemplificataRID @it

SoundAndSoundscapes
type: NamedIndividual
type: Content
label: SuoniEPaesaggiSonori @it

SpeechInterviewOralSource
type: NamedIndividual
type: Content
label: ParlatoIntervisteFontiOrali @it

TimedTranscription
type: NamedIndividual
type: EthnomusicologicalTranscription
label: TrascrizioneTemporizzata @it

VeryGood
type: NamedIndividual
type: ConservationStatusType
label: Discreto @it

WorkTitleVariantForm
type: NamedIndividual
type: TitleNatureOrSubtype
label: FormaVarianteTitoloOpera @it

Adaptation
type: NamedIndividual
type: MusicalElaborationType
label: Adattamento @it

Aerophones
type: NamedIndividual
type: MusicalInstrumentClass
label: Aerofoni @it

CagliariModel
type: NamedIndividual
type: EthnomusicologicalAnnotation
label: ModelloCagliari @it

Chordophones
type: NamedIndividual
type: MusicalInstrumentClass
label: Cordofoni @it

Contrafactum
type: NamedIndividual
type: MusicalElaborationType
comment: Termini elaborati dal progetto MIMO (Musical Instrument Museum Online) utilizzati come soggettario per la navigazione nel portale e utili per una migliore interoperabilità. In particolare ci si riferisce a definizioni tipologiche e/o denominazioni locali di strumenti @it
comment: Terms developed by the MIMO (Musical Instrument Museum Online) project, used as a subject heading for navigation in the portal and helpful for better interoperability. Specifically, this refers to typological definitions and/or local denominations of instruments

Cue
type: NamedIndividual
type: EthnomusicologicalResourceType

CueM
type: NamedIndividual
type: EthnomusicologicalResourceType

Cue Sheet
type: NamedIndividual
type: EthnomusicologicalResourceType
label: CueSheet @it

Dataset
type: NamedIndividual
type: Content

Distribution
type: NamedIndividual
type: FilmProductionPhase
label: Distribuzione @it

EthnomusicologicalRecording
type: NamedIndividual
type: EthnomusicologicalResourceType
label: RegistrazioneEtnomusicologica @it

FilmPostProduction
type: NamedIndividual
type: FilmProductionPhase
label: PostProduzioneCinematografica @it

FilmPreProduction
type: NamedIndividual
type: FilmProductionPhase
label: PreProduzioneCinematografica @it

FilmProduction
type: NamedIndividual
type: FilmProductionPhase
label: ProduzioneCinematografica @it

Idiophones
type: NamedIndividual
type: MusicalInstrumentClass
label: Idiofoni @it

Laban
type: NamedIndividual
type: EthnocoreologicalTranscription

LegalDeposit
type: NamedIndividual
type: MusicProductionPhase
label: DepositoLegale @it

Membranophones
type: NamedIndividual
type: MusicalInstrumentClass
label: Membranofoni @it

Music
type: NamedIndividual
type: Content
label: Musica @it

MusicPostProduction
type: NamedIndividual
type: MusicProductionPhase
label: PostProduzioneMusicale @it

MusicPreProduction
type: NamedIndividual
type: MusicProductionPhase
label: PreProduzioneMusicale @it

MusicProduction
type: NamedIndividual
type: MusicProductionPhase
label: ProduzioneMusicale @it

MusicalArrangement
type: NamedIndividual
type: MusicProductionPhase
label: Arrangiamento @it

ParallelTitle
type: NamedIndividual
type: TitleNatureOrSubtype
label: TitoloParallelo @it

Reduction
type: NamedIndividual
type: MusicalElaborationType
label: Riduzione @it

VideoLaban
type: NamedIndividual
type: EthnocoreologicalAnnotation

Image/Photo
type: NamedIndividual
type: Content
label: Immagine @it

numberOfItems
comment: It refers to the quantity (number) of Mediums of Performance